program: Gaussian 09
title: 000283975
version: EM64L-G09RevD.01
frameworkgroup: C1[X(C17H17N5O6)]
method: RPBEPBE
basis: SDD
operation: Freq
keyword: #p
keyword: freq=noraman
keyword: PBEPBE/SDD
title: #p freq=noraman PBEPBE/SDD
converged: YES YES NO NO
title: Mulliken charges:
elementType: O O O O O O N N N N N C C C C C C C C C C C C C C C C C H H H H H H H H H H H H H H H H H
charge: -0.306678 -0.266646 -0.191222 -0.272393 -0.215889 -0.209016 -0.440623 -0.422113 -0.063727 0.022422 0.014738 0.426295 0.308375 -0.495181 0.054752 0.149140 -0.401552 -0.319348 0.299780 0.256330 -0.796238 -0.287484 -0.499497 0.446444 -0.370100 0.210707 -0.525999 -0.794955 0.299576 0.265436 0.243862 0.349579 0.257032 0.249134 0.272361 0.378471 0.289381 0.335452 0.290777 0.247254 0.232429 0.232029 0.239433 0.268410 0.239061
chargesum: 0.00000
title: Mulliken charges with hydrogens summed into heavy atoms:
elementType: O O O O O O N N N N N C C C C C C C C C C C C C C C C C
charge: -0.306678 -0.266646 -0.191222 -0.272393 -0.215889 -0.209016 -0.091044 -0.043642 -0.063727 0.022422 0.014738 0.426295 0.308375 -0.195605 0.054752 0.149140 -0.136116 -0.075486 0.299780 0.256330 -0.017711 0.001897 -0.164045 0.446444 -0.079323 0.210707 0.185712 -0.048051
polarizability: 6.56345082e+02 4.92283684e+00 3.20564054e+02 2.60099133e+00 -1.63184127e+00 1.07780695e+02
1716.lowfreq: -80.5526 -1.7405 -0.0010 -0.0004 0.0004 2.7379 4.0219 8.4099 23.7035
frequency: -80.5523 8.3807 23.7000 33.4956 47.6923 61.6756 66.9302 70.9687 79.1084 87.9508 91.5600 114.3435 124.2772 132.3612 148.4023 155.3511 164.4557 181.8483 210.6201 226.3362 240.0878 270.9875 289.2556 304.7106 310.7268 332.7672 335.2451 365.5716 386.2082 395.9594 405.6407 446.5333 455.6803 463.9604 503.2874 513.2457 514.4572 529.3837 551.0138 578.6659 591.4147 613.2930 639.0251 642.3033 649.1772 652.3577 669.2934 704.4375 711.7370 721.9691 724.4537 751.0563 752.6671 772.6520 816.8591 839.0573 843.7273 858.7205 891.4958 904.9627 930.6456 934.2966 956.2856 964.1339 971.3976 988.6603 998.2873 1008.1207 1028.5318 1032.5948 1046.5534 1075.0568 1087.6238 1099.9577 1115.3877 1129.5272 1136.7624 1153.2681 1165.3302 1200.2918 1210.0067 1229.3773 1232.3862 1263.8724 1277.2789 1299.3498 1323.7235 1342.4223 1359.3293 1376.8892 1379.6965 1386.5779 1398.5273 1427.0678 1439.8798 1447.0313 1450.4346 1460.5723 1466.9238 1467.6188 1471.1799 1480.7893 1485.7592 1491.5193 1509.8621 1518.6052 1530.4946 1581.2145 1596.5242 1611.4630 1622.2278 1625.9668 2974.6405 2975.0339 2988.9446 3042.6788 3068.9261 3073.9011 3133.7575 3137.1246 3141.0351 3156.9064 3180.0199 3181.2747 3189.3053 3196.6102 3202.2639 3213.1949 3504.0272
redmass: 1.0383 6.3784 5.8868 7.0528 5.3082 10.3404 4.0591 5.8855 5.6778 3.6629 5.4987 4.8021 3.8681 1.3994 4.6901 7.5480 5.2161 5.6565 1.8622 5.8092 1.7805 4.4051 6.2919 5.1575 6.1901 4.1301 5.1378 10.6728 5.5392 5.9705 6.8341 4.4115 3.2703 5.5139 7.0092 3.5316 4.8597 3.7576 5.2567 3.0692 4.8395 5.7584 6.2505 3.5350 7.6643 5.4302 8.9380 7.9761 4.7765 4.7680 1.2392 3.4093 12.3469 5.6650 1.4407 1.2128 4.7787 1.3748 6.4233 4.0948 1.4912 5.3975 1.3610 1.4034 2.2777 8.2827 1.7080 1.3166 1.5997 1.6666 2.2563 2.1657 3.6875 4.1448 1.2559 1.7801 1.3716 1.4619 9.6277 1.9450 4.8037 2.6175 1.8797 2.0711 1.6078 2.1996 3.9243 4.1532 6.7431 1.3080 4.4690 4.0863 1.2729 2.5068 1.5919 1.2249 5.0873 1.4934 1.0468 1.0519 1.1809 1.4801 1.6845 1.5451 2.9502 4.7329 2.7661 4.2393 5.8689 6.2829 7.2555 5.1630 1.0321 1.0428 1.0383 1.0970 1.1048 1.0982 1.1008 1.0981 1.0934 1.0880 1.0896 1.0951 1.0919 1.0914 1.0958 1.0788 1.0764
irintensity: 0.1806 0.5341 0.0974 0.7236 0.3728 0.3527 5.6135 4.6068 5.8133 1.1852 4.5087 0.2882 2.0987 0.8382 6.8391 2.4180 3.7644 2.7488 0.4322 0.7572 1.5633 5.2932 0.1239 2.0998 0.2762 2.1500 0.4006 2.9327 3.6994 21.2170 21.0398 1.6804 4.5531 8.5731 27.8625 14.0903 14.1240 0.7156 0.7829 0.0867 12.1634 0.3727 22.9588 7.1314 13.1405 0.5196 15.4952 7.0624 4.6609 0.4086 86.4094 3.2544 6.4974 1.9154 36.1284 109.2694 4.8569 10.0978 3.6353 20.2128 28.8274 7.5611 1.5959 24.7423 16.1319 63.5852 30.3263 0.0444 1.6694 8.6928 16.6486 119.6014 14.9545 60.1031 0.1289 71.6491 84.9244 0.9275 392.7644 49.4603 763.1925 109.9894 153.3259 233.7659 56.7244 169.9942 9.3798 454.1321 21.2286 41.9318 28.8235 64.7275 24.3803 256.0496 70.4515 42.2371 7.7868 30.1988 23.4820 13.1199 85.9643 47.9609 59.0986 41.5227 114.0207 490.3627 138.4958 158.8052 150.6567 96.0359 436.5482 91.3865 75.7484 4.6614 8.5261 8.0763 35.6769 14.5512 22.3596 6.8957 11.0421 9.0824 3.9697 6.6354 21.7715 8.6669 0.2365 63.6395 48.7899
temp: 298.150 k
press: 1.00000 atm
elementType: 8 8 8 8 8 8 7 7 7 7 7 6 6 6 6 6 6 6 6 6 6 6 6 6 6 6 6 6 1 1 1 1 1 1 1 1 1 1 1 1 1 1 1 1 1
symmnumber: 1
zpe: 868013.0 jmol-1
zpe.correction: 0.330609 hartree
zpe.thermalcorrener: 0.356463 hartree
zpe.thermalcorrenthalpy: 0.357407 hartree
zpe.thermalcorrgfe: 0.271459 hartree
zpe.sumelectzpe: -1380.922963 hartree
zpe.sumelectthermal: -1380.897109 hartree
zpe.sumelectthermalent: -1380.896164 hartree
zpe.sumelectthermalfe: -1380.982113 hartree
dipole: 12.8095 5.2305 0.4118
dipole: 13.8424
quadrupole: -185.3035 -167.4213 -163.0975
quadrupole: 26.5950 -0.9793 1.7239
quadrupole: -13.3627 4.5194 8.8433 26.5950 -0.9793 1.7239
hfenergy: -1381.2535716 hartree
pointgroup: C01 [X(C17H17N5O6)]
dipole: 5.2346929 0.9409823 1.1711728 debye
polarizability: 634.9329404|83.388813|126.0789297|-56.4914525|23.8858534|323.677961 unknown
InChI: InChI=1S/C17H17N5O6/c1-10(12-4-7-17(28-3)15(8-12)18-11(2)23)19-20-14-6-5-13(21(24)25)9-16(14)22(26)27/h4-9,18,20H,1-3H3
charge 0 multiplicity 1
45 atoms
O  5.763806 1.045581 1.446119
O  4.786254 0.508948 -3.365765
O  -5.431378 -1.540651 -2.040047
O  -3.205412 -1.236012 -2.425174
O  -6.07872 -0.337854 4.088782
O  -7.38392 -0.925364 2.305804
N  5.545529 0.841657 -1.171021
N  -1.621149 -0.569465 -0.475597
N  -0.384661 -0.253321 0.06639
N  -4.250281 -1.246301 -1.619991
N  -6.243018 -0.627269 2.836612
C  1.970797 0.06817 -0.176511
C  4.361679 0.609743 -0.427833
C  3.112411 0.285284 -0.998204
C  0.65472 -0.269034 -0.770271
C  4.474913 0.721007 0.992816
C  2.109295 0.186704 1.235702
C  3.349025 0.509158 1.816425
C  -2.742597 -0.583007 0.320405
C  -4.046986 -0.91226 -0.213633
C  0.504645 -0.614518 -2.241959
C  -2.656752 -0.269735 1.718117
C  -5.190524 -0.925433 0.614766
C  -5.052238 -0.613788 1.971675
C  -3.784094 -0.283028 2.532133
C  5.72029 0.785266 -2.555072
C  5.973078 1.187434 2.891203
C  7.147126 1.08719 -3.009225
H  3.0702 0.225951 -2.085877
H  1.233377 0.017004 1.866411
H  3.43162 0.588277 2.90423
H  6.360138 1.070828 -0.59288
H  -0.11422 0.137552 -2.770089
H  0.005859 -1.595679 -2.368446
H  1.469003 -0.67468 -2.761125
H  -1.791202 -0.800821 -1.476611
H  -1.671217 -0.018327 2.113054
H  -6.166778 -1.17732 0.192913
H  -3.723828 -0.044076 3.597015
H  7.036371 1.442231 3.006204
H  5.345326 1.999827 3.302523
H  5.755338 0.238667 3.416286
H  7.458504 2.10352 -2.704577
H  7.188833 1.01756 -4.105422
H  7.865835 0.365678 -2.578452
