program: Gaussian 09
title: 000024186
version: EM64L-G09RevD.01
frameworkgroup: C1[X(C11H16N2O3)]
method: RPBEPBE
basis: SDD
operation: Freq
keyword: #p
keyword: freq=noraman
keyword: PBEPBE/SDD
title: #p freq=noraman PBEPBE/SDD
converged: YES YES NO NO
title: Mulliken charges:
elementType: O O O N N C C C C C C C C C C C H H H H H H H H H H H H H H H H
charge: -0.224505 -0.211073 -0.234669 -0.190382 -0.373281 0.105602 -0.399844 -0.412335 0.203956 0.116516 -0.705296 -0.722036 0.183536 -0.431847 -0.027772 -0.552970 0.214349 0.248400 0.241000 0.226710 0.254466 0.228191 0.219130 0.227925 0.233639 0.222662 0.363528 0.255658 0.245117 0.248324 0.219071 0.228227
chargesum: 0.00000
title: Mulliken charges with hydrogens summed into heavy atoms:
elementType: O O O N N C C C C C C C C C C C
charge: -0.224505 -0.211073 -0.234669 -0.190382 -0.009753 0.105602 0.062905 0.055376 0.203956 0.116516 -0.003509 -0.037810 0.183536 0.068928 0.220552 -0.105671
polarizability: 1.57617552e+02 -2.02969580e+00 1.48252444e+02 -4.65145695e-01 -4.05543581e+00 1.08242682e+02
1716.lowfreq: -15.7853 -0.0002 0.0005 0.0006 2.8441 6.4081 24.8402 35.9110 44.7202
frequency: 24.6417 35.8258 44.6161 76.0649 79.0866 104.9790 150.5295 157.0557 167.1160 175.6339 203.9705 212.3852 255.4986 288.9399 307.9417 323.4215 343.4916 374.8264 390.4512 410.1248 445.7163 464.0128 478.7063 566.4416 640.0773 658.7196 661.4007 697.5630 707.5439 733.8907 769.1951 774.5106 782.2919 839.8162 897.9201 926.9269 936.5578 946.6144 963.8722 989.3388 1011.3039 1034.2238 1052.6333 1073.7997 1079.9945 1094.5976 1139.8321 1157.0370 1183.4054 1196.6419 1273.7971 1285.0841 1289.8307 1308.2124 1318.3980 1330.1352 1336.0670 1346.7394 1373.6229 1378.4989 1393.9072 1398.4263 1428.0074 1447.8683 1448.9881 1466.0822 1472.1776 1481.3572 1487.8579 1489.1765 1586.6759 1642.1897 1651.5749 1660.0598 2981.1450 2984.6219 2994.1807 3020.0894 3041.2915 3042.4408 3070.5998 3081.9162 3083.6663 3091.7405 3097.4806 3101.8128 3107.0280 3123.3456 3202.4069 3516.9329
redmass: 3.6642 4.8843 5.1688 2.1635 2.5354 2.2565 6.8277 3.6517 3.4943 2.6289 1.3613 2.2146 1.6338 2.2862 2.8915 3.1917 5.6357 4.9913 2.9122 5.2498 3.3295 4.3851 3.1280 4.7985 2.7581 2.9902 2.9981 5.6811 5.7845 3.2050 1.6211 1.6712 1.2876 2.3161 1.6960 3.3027 2.2385 1.8597 1.3312 2.1312 1.1758 2.7532 1.5341 1.9842 2.6890 3.0008 3.5108 2.8380 2.5160 2.7389 1.4000 1.2678 1.6911 1.4651 1.6277 1.3454 1.3787 1.7413 2.5159 2.1610 1.2107 1.2028 1.1869 1.0992 1.0982 1.0838 1.0499 1.0488 1.0441 1.0496 11.0370 5.6308 9.3147 4.6319 1.0591 1.0360 1.0370 1.0612 1.0607 1.1013 1.0997 1.0985 1.0988 1.0605 1.1025 1.1008 1.0977 1.1003 1.1150 1.0768
irintensity: 0.3972 0.8210 0.1174 0.4589 0.0902 0.2274 8.5994 0.4056 4.6625 1.6251 0.7058 0.5166 1.0229 3.9702 1.8201 5.3860 19.6946 9.4529 4.7263 8.8601 6.9583 13.1146 5.0310 3.3100 14.1777 11.2844 11.3259 4.2423 7.4957 13.0932 17.1485 97.9282 14.0289 3.8631 5.6017 3.0911 7.2196 14.3207 83.3358 7.7832 25.9504 14.9769 4.0871 2.6098 32.7555 4.5048 13.5657 27.8056 1.7028 32.6235 62.1183 8.3714 57.2166 97.6259 81.3412 13.2282 11.2455 122.5359 170.9825 61.0650 12.3087 25.8855 14.6134 19.7344 63.8875 11.3832 5.6968 8.6345 18.7031 7.7049 312.0295 438.4225 115.5523 5.6073 21.4926 22.9909 20.7644 15.5602 14.5898 6.8342 5.9176 35.7380 24.5571 5.5424 28.3942 24.4300 3.3629 3.3814 19.1899 64.2071
temp: 298.150 k
press: 1.00000 atm
elementType: 8 8 8 7 7 6 6 6 6 6 6 6 6 6 6 6 1 1 1 1 1 1 1 1 1 1 1 1 1 1 1 1
symmnumber: 1
zpe: 681073.6 jmol-1
zpe.correction: 0.259407 hartree
zpe.thermalcorrener: 0.276433 hartree
zpe.thermalcorrenthalpy: 0.277377 hartree
zpe.thermalcorrgfe: 0.213673 hartree
zpe.sumelectzpe: -762.748469 hartree
zpe.sumelectthermal: -762.731443 hartree
zpe.sumelectthermalent: -762.730499 hartree
zpe.sumelectthermalfe: -762.794203 hartree
dipole: 0.5419 -1.3795 -0.6966
dipole: 1.6376
quadrupole: -101.4744 -100.8838 -93.4662
quadrupole: -0.8393 -2.5465 4.4896
quadrupole: -2.8663 -2.2757 5.1419 -0.8393 -2.5465 4.4896
hfenergy: -763.0078759 hartree
pointgroup: C01 [X(C11H16N2O3)]
dipole: -0.2619896 0.4972441 -0.3150089 debye
polarizability: 157.865486|-1.2442836|148.4026314|-0.8169898|0.4415141|107.8445606 unknown
InChI: InChI=1S/C11H16N2O3/c1-4-7-13-9(15)11(5-2,6-3)8(14)12-10(13)16/h4,12H,1,5-7H2,2-3H3
charge 0 multiplicity 1
32 atoms
O  -0.448113 1.696729 1.069224
O  2.840534 -1.300928 -0.782918
O  -1.489506 -2.735068 0.035414
N  -1.010639 -0.481572 0.483844
N  0.664222 -1.95363 -0.364728
C  1.224366 0.475425 -0.237427
C  0.996063 1.044441 -1.708807
C  2.343111 1.266258 0.497874
C  -0.11076 0.618531 0.512501
C  1.669079 -0.976745 -0.458434
C  0.676114 2.549423 -1.794314
C  2.69616 0.705249 1.891511
C  -0.672128 -1.777621 0.042624
C  -2.408083 -0.278313 0.988028
C  -3.364693 0.053861 -0.141723
C  -3.997798 1.246129 -0.264306
H  0.182795 0.464342 -2.189315
H  1.925719 0.823905 -2.267328
H  2.004934 2.310924 0.600021
H  3.239456 1.252377 -0.148559
H  -0.206219 2.820942 -1.190513
H  1.524286 3.168011 -1.454815
H  0.468862 2.816691 -2.846702
H  1.822247 0.726549 2.568122
H  3.074388 -0.330935 1.828857
H  3.488068 1.318344 2.357384
H  0.920658 -2.915369 -0.611689
H  -2.709051 -1.215258 1.486588
H  -2.363354 0.541454 1.721403
H  -3.54106 -0.748962 -0.871113
H  -4.697523 1.440633 -1.084971
H  -3.833735 2.059383 0.45297
