program: Gaussian 09
title: 000283902
version: EM64L-G09RevD.01
frameworkgroup: C1[X(C10H8O4)]
method: RPBEPBE
basis: SDD
operation: Freq
keyword: #pfreq=noraman
keyword: PBEPBE/SDD
title: #p freq=noraman PBEPBE/SDD
converged: NO YES NO YES
title: Mulliken charges:
elementType: O O O O C C C C C C C C C C H H H H H H H H
charge: -0.234412 -0.250171 -0.171605 -0.171612 -0.037621 0.213523 0.442088 -0.530937 -0.566355 0.365278 0.138041 0.117518 -0.790668 -0.534746 0.285731 0.268913 0.253766 0.228228 0.253773 0.233079 0.233081 0.255108
chargesum: 0.00000
title: Mulliken charges with hydrogens summed into heavy atoms:
elementType: O O O O C C C C C C C C C C
charge: -0.234412 -0.250171 -0.171605 -0.171612 -0.037621 0.213523 0.442088 -0.245206 -0.297442 0.365278 0.138041 0.117518 -0.054900 0.186522
polarizability: 1.74337884e+02 1.06099251e+01 1.44406008e+02 -3.04753464e-03 8.73864824e-03 5.65780318e+01
1716.lowfreq: -7.1483 -5.3617 -0.0008 0.0001 0.0005 6.9407 58.2059 71.4403 109.2768
frequency: 58.1735 71.4337 109.2695 142.9605 162.5980 167.9134 219.6400 222.7826 233.1067 295.3760 308.3567 320.7690 441.0189 446.0839 479.5337 526.4590 566.8458 575.7100 595.5783 666.5766 670.7023 707.9643 710.1792 753.7085 768.4515 879.2406 899.5589 901.6288 925.5882 990.1443 1020.3894 1045.9597 1082.2923 1113.9359 1132.2478 1161.2644 1207.1328 1235.9582 1311.2987 1396.5676 1404.3302 1427.4686 1439.7725 1458.8425 1470.2151 1471.1910 1479.7268 1487.5268 1583.2178 1633.8993 1685.2684 1739.4732 2976.2278 2993.6331 3071.1188 3072.7392 3105.1069 3140.3455 3162.6079 3177.6804
redmass: 1.1227 3.9553 3.4484 5.1247 5.0288 9.5189 1.6237 3.4937 2.0941 4.0265 3.8987 10.7790 5.9101 6.6230 5.3472 6.5275 4.5275 4.6092 13.6052 3.2333 6.8820 8.4283 7.2804 6.3034 11.7832 1.5444 1.4419 7.6468 6.4026 2.5595 2.3584 1.5658 3.8156 1.2576 2.3088 1.6000 3.2352 1.3670 6.6134 5.2468 1.3340 2.2293 1.2871 1.0434 1.0622 1.0485 1.4692 3.0902 7.6912 8.2452 12.8124 12.7948 1.0325 1.0373 1.1048 1.0963 1.1007 1.1007 1.0919 1.0926
irintensity: 1.3923 0.3419 3.7093 8.0038 4.5557 0.1234 0.0300 5.0185 0.1260 1.7830 0.4730 1.7830 10.8812 1.1753 2.7589 16.5209 0.1442 18.5262 6.2729 16.8921 3.0506 15.5533 16.0132 1.1087 159.0761 23.2927 17.6076 28.4399 28.0390 5.4044 57.6619 11.3929 43.6530 0.0729 106.6704 31.5236 62.5977 12.5958 328.2759 4.3508 17.4576 14.1815 5.2584 15.8490 48.3855 16.3154 34.8477 48.3395 89.1206 159.0244 482.0749 224.5069 49.2421 7.6238 34.5288 7.7424 18.3299 17.0728 2.0273 2.4610
temp: 298.150 k
press: 1.00000 atm
elementType: 8 8 8 8 6 6 6 6 6 6 6 6 6 6 1 1 1 1 1 1 1 1
symmnumber: 1
zpe: 415731.0 jmol-1
zpe.correction: 0.158344 hartree
zpe.thermalcorrener: 0.170857 hartree
zpe.thermalcorrenthalpy: 0.171801 hartree
zpe.thermalcorrgfe: 0.119340 hartree
zpe.sumelectzpe: -685.769613 hartree
zpe.sumelectthermal: -685.757100 hartree
zpe.sumelectthermalent: -685.756155 hartree
zpe.sumelectthermalfe: -685.808616 hartree
dipole: -6.8241 2.5081 0.0006
dipole: 7.2704
quadrupole: -84.4363 -84.6683 -79.6377
quadrupole: 11.0300 0.0011 -0.0020
quadrupole: -1.5222 -1.7542 3.2764 11.0300 0.0011 -0.0020
hfenergy: -685.9279563 hartree
pointgroup: C01 [X(C10H8O4)]
dipole: 2.7255743 0.8677794 -0.000239 debye
dipolederiv: -0.7953246 0.2556096 -0.0000232 0.0753029 -1.2580019 0.0001066 0.0000521 -0.000009 -0.2257622 -1.8479391 0.3879215 0.0000226 0.2385022 -0.3750259 -0.0000029 0.0000252 0.0000042 -0.2938803 -1.105052 0.3277305 0.0000325 0.414989 -0.7097173 -0.0000045 -0.0000803 0.0000753 -0.2949621 -0.4546187 0.012832 0.0000096 -0.0803395 -1.1933075 0.0000128 0.0000085 0.0002128 -0.3088373 -0.9673777 -0.006829 0.0000138 0.0701024 -0.2660936 0.0000178 0.0000305 0.0000108 -0.0777059 0.146806 -0.3527777 0.0000493 -0.4217975 -0.2768414 0.0000621 0.0000205 0.0000413 0.0402127 0.3744989 -0.3309527 0.0000095 -0.0224457 0.4667139 -0.0000316 -0.000032 0.0000051 0.0411224 -0.559352 0.0986626 0.000008 -0.4423365 -0.0504596 0.0000109 0.0000511 -0.0000248 -0.1729127 -0.416946 0.2839694 -0.000011 0.3908069 -0.1609944 -0.0000205 -0.0000248 -0.0000191 -0.1767596 1.7862164 -0.2216666 -0.0000413 0.1932052 0.1301303 -0.0000086 -0.0000497 -0.0000036 0.1432003 1.8791925 -0.1203285 -0.0000731 -0.2336148 1.4998579 -0.0000854 -0.0000022 -0.0001317 0.2942686 1.1361769 -0.1700212 -0.0000167 0.1219684 1.7407938 -0.0000843 -0.0000318 -0.0001538 0.2851812 -0.0211642 0.2495858 -0.0000251 0.1076355 -0.1206223 -0.0000095 0.0000128 -0.000059 0.018398 0.6218671 -0.184119 0.0000059 -0.5605919 0.4501671 0.0000098 0.00005 -0.0000087 0.3090027 0.0765646 0.0357977 0.0000014 0.0724044 0.0287574 0.0000075 -0.0000208 -0.0000016 0.1710622 0.0612265 -0.0561539 0.0000078 -0.0718509 0.004831 0.0000202 0.0000025 0.0000251 0.1602025 0.0511004 0.0212111 0.0913186 -0.0023451 0.0580399 0.017674 0.0807961 -0.019521 -0.007498 -0.0133511 -0.1724561 0.0000543 -0.0525647 -0.0406149 0.000039 0.0000285 0.000059 0.1130245 0.0510418 0.0211838 -0.0913487 -0.0023965 0.0580596 -0.0177029 -0.0808149 0.0194965 -0.0074106 0.0638145 -0.0371505 -0.0798387 0.1288533 -0.0336598 -0.0819823 -0.0171565 -0.0955104 -0.0694072 0.0638246 -0.0371261 0.0798324 0.128863 -0.0336242 0.0819645 0.0171182 0.0955073 -0.0694495 -0.1312045 -0.0049229 0.000012 -0.0523503 0.0816119 0.0000074 0.0000169 0.0000054 0.1289103 unknown
polarizability: 173.3481517|-11.8834128|145.3957404|-0.0034287|-0.0085962|56.5780318 unknown
InChI: InChI=1S/C10H8O4/c1-5-3-6(13-2)4-7-8(5)10(12)14-9(7)11/h3-4H,1-2H3
charge 0 multiplicity 1
22 atoms
O  -2.526147 -1.206218 0.000185
O  3.333992 0.323537 -0.000203
O  -3.266868 1.034139 -0.000057
O  -1.124085 -3.094679 0.000379
C  -0.846755 0.467096 -0.000052
C  -0.202869 -0.789824 0.000018
C  -0.103713 1.678678 -0.000218
C  1.189908 -0.933615 0.000002
C  1.301409 1.543963 -0.000257
C  1.944682 0.271804 -0.000139
C  -2.30834 0.252139 0.000112
C  -1.239339 -1.862121 0.000039
C  -0.773431 3.034967 -0.000293
C  4.074644 -0.947424 -0.000113
H  1.645596 -1.926732 0.000057
H  1.941943 2.431488 -0.00037
H  -1.428204 3.153138 0.88177
H  -0.030462 3.84881 -0.000575
H  -1.428591 3.152861 -0.882103
H  3.846567 -1.539181 -0.906218
H  3.846651 -1.539005 0.906128
H  5.134508 -0.657423 -0.00019
