program: Gaussian 09
title: 000283904
version: EM64L-G09RevD.01
frameworkgroup: C1[X(C13H14O3)]
method: RPBEPBE
basis: SDD
operation: Freq
keyword: #pfreq=noraman
keyword: PBEPBE/SDD
title: #p freq=noraman PBEPBE/SDD
converged: YES YES NO NO
title: Mulliken charges:
elementType: O O O C C C C C C C C C C C C C H H H H H H H H H H H H H H
charge: -0.246932 -0.408093 -0.264372 -0.128759 -0.329060 -0.543297 -0.414911 0.128962 -0.484067 0.306807 0.221747 -0.367119 -0.355688 -0.259303 -0.233441 -0.227319 0.272101 0.267503 0.272075 0.235091 0.220090 0.217596 0.252992 0.251575 0.268612 0.276997 0.231134 0.230989 0.230650 0.377440
chargesum: 0.00000
title: Mulliken charges with hydrogens summed into heavy atoms:
elementType: O O O C C C C C C C C C C C C C
charge: -0.246932 -0.030654 -0.264372 0.143343 -0.061557 -0.036131 0.022775 0.128962 0.020500 0.306807 0.221747 -0.098508 -0.078691 -0.028169 -0.002452 0.003331
polarizability: 1.86769613e+02 -2.60703276e+01 1.47127080e+02 6.86535834e+00 1.23635901e+01 1.04400059e+02
1716.lowfreq: -9.7065 -6.5005 -0.0004 0.0001 0.0004 7.8259 24.0774 30.8643 52.5417
frequency: 23.7224 30.7478 52.5382 60.0686 93.0989 114.1844 134.8277 185.6660 213.0949 238.3194 293.0406 304.9643 360.1811 363.0839 403.5322 430.4938 478.7508 498.7137 504.3497 586.2153 613.1796 646.7053 652.0912 677.4159 701.8942 735.7269 762.3121 786.6395 813.8204 832.6742 865.4212 890.5354 906.2592 943.1714 954.1502 975.7617 988.2278 995.7919 1008.2993 1016.6896 1028.9160 1049.0915 1061.5583 1078.6518 1081.2149 1091.9983 1104.7894 1128.2415 1171.9939 1191.7275 1208.4274 1216.4596 1229.4253 1238.1423 1262.3825 1310.1305 1321.3316 1358.3380 1370.0255 1385.3502 1410.7012 1432.1074 1437.2798 1443.9459 1457.5848 1482.3851 1549.4842 1592.4025 1609.0817 1659.4190 2984.6082 2996.8071 3043.2823 3063.7726 3094.6549 3104.6786 3125.6135 3137.1272 3149.8515 3158.5321 3167.3541 3179.9998 3208.7945 3510.2797
redmass: 6.5963 5.4716 4.3323 4.7802 6.0863 4.7799 4.8619 3.8734 4.6092 2.9936 3.5768 4.1508 3.1037 3.0194 2.8426 4.2534 4.3153 3.3623 2.1040 3.0700 6.4232 4.8346 1.4352 4.6165 1.8606 1.9827 2.7752 2.6245 2.5084 3.1362 1.2453 2.5805 1.9237 1.5106 1.4686 2.6670 4.3640 1.5120 1.3396 3.0459 2.2915 2.1571 1.3223 1.5866 1.1926 1.7876 1.6052 1.4805 1.0639 1.1583 1.7205 1.3866 1.3802 2.1157 1.6185 1.3422 1.3597 1.5763 1.8133 8.7170 1.6391 1.7648 1.2006 1.7183 1.0855 2.2028 7.4525 6.1906 6.0361 8.0060 1.0618 1.0641 1.0999 1.0956 1.0555 1.0899 1.0851 1.0886 1.0928 1.0957 1.1007 1.0911 1.1151 1.0640
irintensity: 0.5558 2.7828 0.2025 2.7663 1.0797 1.5073 2.4180 0.5322 2.9856 1.9403 7.2463 1.4192 1.5322 3.0403 0.3046 2.6440 5.5879 21.3538 29.6031 9.3706 0.3472 5.5408 150.6316 8.7116 58.4203 30.7615 5.4113 20.5268 6.1877 37.3782 0.1622 7.0837 7.1426 24.5664 4.1476 60.0064 1.9804 0.5322 1.2974 44.8285 41.9609 134.0222 25.9577 71.0032 8.4971 6.7393 15.3364 17.8865 3.8145 11.4498 5.8775 1.9749 31.2858 167.7880 6.0455 3.8806 13.3065 82.8226 35.6735 3.4743 63.9710 9.8928 21.5211 81.3326 14.0627 7.3872 92.2109 10.6082 16.0887 202.2076 27.2190 26.2381 11.1316 11.2858 16.2698 7.9213 0.1413 14.5060 12.6573 9.2027 26.8717 2.0541 4.2686 19.2377
temp: 298.150 k
press: 1.00000 atm
elementType: 8 8 8 6 6 6 6 6 6 6 6 6 6 6 6 6 1 1 1 1 1 1 1 1 1 1 1 1 1 1
symmnumber: 1
zpe: 628184.8 jmol-1
zpe.correction: 0.239263 hartree
zpe.thermalcorrener: 0.254184 hartree
zpe.thermalcorrenthalpy: 0.255128 hartree
zpe.thermalcorrgfe: 0.195100 hartree
zpe.sumelectzpe: -728.269292 hartree
zpe.sumelectthermal: -728.254371 hartree
zpe.sumelectthermalent: -728.253427 hartree
zpe.sumelectthermalfe: -728.313455 hartree
dipole: -1.3799 -2.6025 -0.7467
dipole: 3.0389
quadrupole: -77.2295 -92.6661 -98.7679
quadrupole: -6.2015 0.4685 -3.5278
quadrupole: 12.3250 -3.1116 -9.2134 -6.2015 0.4685 -3.5278
hfenergy: -728.5085553 hartree
pointgroup: C01 [X(C13H14O3)]
dipole: -0.5663081 0.2594946 1.0204893 debye
polarizability: 176.1757704|35.829303|119.4607041|11.6432323|18.5556048|142.6602771 unknown
InChI: InChI=1S/C13H14O3/c14-12(15)7-6-10-8-11(10)13(16)9-4-2-1-3-5-9/h1-5,10-11,14H,6-8H2
charge 0 multiplicity 1
30 atoms
O  0.680407 -0.605291 -2.559976
O  -2.510846 1.88738 1.515385
O  -1.614009 -0.177056 2.065422
C  -1.851458 -1.405652 -1.179305
C  -0.395608 -1.538074 -0.626035
C  -1.058157 -2.666679 -1.454861
C  -3.035383 -1.412489 -0.219699
C  0.672659 -0.732714 -1.291937
C  -3.391327 -0.015366 0.335302
C  1.739376 -0.076016 -0.457066
C  -2.40959 0.497959 1.372443
C  1.650279 0.050006 0.956672
C  2.874191 0.454916 -1.129879
C  2.682537 0.690677 1.677091
C  3.90582 1.08547 -0.407936
C  3.813338 1.204095 1.000683
H  -1.929373 -0.714833 -2.029046
H  -0.316084 -1.706259 0.448675
H  -0.659169 -2.801596 -2.464004
H  -1.319584 -3.581593 -0.913839
H  -2.835224 -2.102132 0.622219
H  -3.921174 -1.807569 -0.7554
H  -3.467723 0.734122 -0.472583
H  -4.385549 -0.038845 0.826161
H  0.775009 -0.322548 1.498724
H  2.916014 0.358091 -2.219891
H  2.605015 0.787307 2.765768
H  4.779648 1.483858 -0.935291
H  4.615241 1.693968 1.564807
H  -1.873874 2.195665 2.216397
