program: Gaussian 09
title: 000283914
version: EM64L-G09RevD.01
frameworkgroup: C1[X(C16H14N2O)]
method: RPBEPBE
basis: SDD
operation: Freq
keyword: #p
keyword: freq=noraman
keyword: PBEPBE/SDD
title: #p freq=noraman PBEPBE/SDD
converged: YES YES NO NO
title: Mulliken charges:
elementType: O N N C C C C C C C C C C C C C C C C H H H H H H H H H H H H H H
charge: -0.281580 -0.345817 -0.362211 0.329751 -0.655406 -0.107369 0.423039 0.362351 0.119918 -0.429016 -0.372528 -0.376411 -0.392879 -0.248661 -0.260473 -0.225575 -0.229272 -0.245916 -0.239332 0.265380 0.229501 0.332933 0.329469 0.241698 0.248927 0.281320 0.236858 0.224951 0.222001 0.231278 0.232802 0.226449 0.233818
chargesum: 0.00000
title: Mulliken charges with hydrogens summed into heavy atoms:
elementType: O N N C C C C C C C C C C C C C C C C
charge: -0.281580 -0.012884 -0.032743 0.329751 -0.160525 -0.107369 0.423039 0.362351 0.119918 -0.187318 -0.123601 -0.095091 -0.156020 -0.023709 -0.038471 0.005703 0.003530 -0.019467 -0.005514
polarizability: 2.74462206e+02 -2.16961288e+01 1.63671044e+02 2.18087374e+01 1.13194818e+01 1.35726804e+02
1716.lowfreq: -11.6455 -5.6763 -0.0003 0.0005 0.0007 1.3884 13.3236 19.9349 54.1166
frequency: 11.7839 19.6754 54.0926 67.2973 93.0084 107.2571 156.0212 201.6338 224.7592 279.0826 301.5581 330.1709 354.2008 374.7195 402.3340 408.1178 463.2302 472.8220 507.0062 539.2547 558.1259 595.1411 597.3286 616.7452 617.8492 656.1923 692.0405 700.6948 709.1675 725.9493 751.7714 771.2630 781.7319 818.5259 848.2956 859.6312 916.0898 923.3465 940.7604 973.4497 977.1044 981.6329 989.0802 990.0204 995.0337 1000.5901 1004.4116 1026.3584 1034.9427 1081.6726 1091.6118 1127.4529 1135.7473 1173.0602 1173.9147 1181.4471 1188.8632 1197.8855 1209.0183 1267.8878 1303.8572 1311.5619 1327.9101 1330.4030 1364.4585 1374.8969 1380.3425 1431.5404 1439.8197 1446.9712 1468.7431 1483.3861 1490.0635 1577.0890 1589.5348 1594.2290 1612.4031 1616.1916 1634.3133 2986.2017 3048.9717 3121.0591 3121.8582 3122.4462 3132.1429 3137.5202 3146.4842 3149.1413 3158.8615 3166.6502 3172.0572 3480.6237 3565.4244
redmass: 3.9066 4.4102 5.6525 4.1077 5.2119 5.3173 5.7207 5.6139 4.5663 6.1941 6.2398 3.0360 2.6984 6.2125 2.8233 2.8552 1.4639 3.3468 2.3553 4.5401 2.4522 4.9301 2.3894 6.3258 6.3320 4.5939 5.1779 1.7585 1.7027 3.6574 6.4091 2.1460 2.4963 3.5856 1.2525 1.2466 1.5016 1.4609 1.7226 1.3984 5.2125 1.4205 3.7289 6.1626 1.5822 1.3122 4.0442 2.2090 2.0634 1.5950 1.6603 2.9532 4.2089 1.0539 1.0646 1.1650 1.1189 1.1427 2.3786 2.3071 1.5590 1.8242 1.3039 1.3834 2.4908 5.3674 8.0732 2.1758 2.1581 2.2421 1.2203 2.1314 2.4200 5.9383 6.8899 6.7334 6.0840 6.1350 8.8636 1.0634 1.0972 1.0845 1.0867 1.0883 1.0884 1.0911 1.0933 1.0959 1.0977 1.1015 1.0978 1.0787 1.0809
irintensity: 0.4565 0.4639 0.7364 1.0592 3.3463 4.2756 1.5617 6.8729 2.7082 1.7254 2.8387 11.7051 9.8725 4.1664 0.1018 0.7273 117.3333 11.7690 49.5752 10.1467 110.7287 88.6141 140.2622 1.8267 7.7173 47.4185 3.7307 47.0031 71.6189 2.3446 1.6941 61.8705 39.6444 4.9394 1.4613 0.4970 3.3274 8.4718 2.3156 0.7304 29.6562 0.1157 3.0966 0.2536 0.8100 0.2822 0.7959 8.3008 1.2973 15.5972 5.3934 12.7552 12.1679 0.0966 0.1842 1.2892 0.8068 1.1754 0.8853 45.7216 2.1329 17.2486 7.5698 13.7774 13.8199 1.4363 0.2927 35.9741 6.3763 22.1009 6.1612 17.7937 23.0810 10.0193 33.7247 23.6009 9.5497 40.8339 376.1624 11.1917 3.4887 2.6661 7.3969 2.5649 10.0132 8.1148 44.8311 31.6016 21.7192 23.3469 11.2933 49.4234 51.5064
temp: 298.150 k
press: 1.00000 atm
elementType: 8 7 7 6 6 6 6 6 6 6 6 6 6 6 6 6 6 6 6 1 1 1 1 1 1 1 1 1 1 1 1 1 1
symmnumber: 1
zpe: 685083.5 jmol-1
zpe.correction: 0.260935 hartree
zpe.thermalcorrener: 0.276559 hartree
zpe.thermalcorrenthalpy: 0.277503 hartree
zpe.thermalcorrgfe: 0.215129 hartree
zpe.sumelectzpe: -801.498338 hartree
zpe.sumelectthermal: -801.482714 hartree
zpe.sumelectthermalent: -801.481770 hartree
zpe.sumelectthermalfe: -801.544143 hartree
dipole: -5.9744 -1.8996 -0.7735
dipole: 6.3167
quadrupole: -103.8129 -113.1474 -106.0601
quadrupole: -15.8856 2.2783 -0.2996
quadrupole: 3.8605 -5.4739 1.6134 -15.8856 2.2783 -0.2996
hfenergy: -801.7592728 hartree
pointgroup: C01 [X(C16H14N2O1)]
dipole: -2.4362927 0.468513 -0.1451525 debye
polarizability: 269.8009803|17.1303399|166.8132696|-33.0536791|-15.1787822|137.2458046 unknown
InChI: InChI=1S/C16H14N2O/c19-16-15(13-9-5-2-6-10-13)14(17-18-16)11-12-7-3-1-4-8-12/h1-10,17-18H,11H2
charge 0 multiplicity 1
33 atoms
O  2.600562 -2.138549 1.639066
N  -0.748034 -1.018561 1.620598
N  0.24856 -1.983802 1.900998
C  -0.175021 -0.071642 0.759269
C  -1.086625 0.944483 0.099967
C  1.197336 -0.303659 0.638285
C  -2.486608 0.402061 -0.188034
C  2.20768 0.492757 -0.077147
C  1.509426 -1.539441 1.400231
C  -3.596595 0.792192 0.603284
C  -2.69557 -0.517033 -1.250712
C  3.404694 -0.127879 -0.540936
C  2.038251 1.888165 -0.316035
C  4.375219 0.6157 -1.243204
C  3.010166 2.627289 -1.02235
C  -4.888605 0.279407 0.339474
C  -3.984271 -1.029697 -1.51722
C  4.182315 1.994252 -1.496853
C  -5.085803 -0.633167 -0.72167
H  -0.60022 1.272119 -0.836358
H  -1.167328 1.841559 0.744823
H  -1.695315 -1.367058 1.432937
H  0.166605 -2.548868 2.748246
H  -3.450436 1.505258 1.423928
H  -1.845594 -0.825259 -1.872044
H  3.567653 -1.187793 -0.325753
H  1.165207 2.410272 0.089596
H  5.288097 0.118485 -1.590401
H  2.860267 3.700254 -1.189099
H  -5.736989 0.594605 0.957027
H  -4.130684 -1.732237 -2.345118
H  4.939334 2.568852 -2.042217
H  -6.086174 -1.028064 -0.930182
