program: Gaussian 09
title: 000283927
version: EM64L-G09RevD.01
frameworkgroup: C1[X(C11H8Br2Cl4O4)]
method: RPBEPBE
basis: SDD
operation: Freq
keyword: #p
keyword: freq=noraman
keyword: PBEPBE/SDD
title: #p freq=noraman PBEPBE/SDD
converged: NO YES NO NO
title: Mulliken charges:
elementType: Br Br Cl Cl Cl Cl O O O O C C C C C C C C C C C H H H H H H H H
charge: 0.168857 0.153595 0.103213 0.116220 0.068751 0.085400 -0.237941 -0.272420 -0.223447 -0.196415 -0.207726 -0.234307 -0.210102 -0.203563 -0.549290 -0.009767 0.014796 0.213650 0.208750 -0.499700 -0.495545 0.391630 0.341210 0.248369 0.241649 0.246735 0.251183 0.250204 0.236011
chargesum: 0.00000
title: Mulliken charges with hydrogens summed into heavy atoms:
elementType: Br Br Cl Cl Cl Cl O O O O C C C C C C C C C C C
charge: 0.168857 0.153595 0.103213 0.116220 0.068751 0.085400 -0.237941 -0.272420 -0.223447 -0.196415 -0.207726 -0.234307 0.181529 0.137647 -0.549290 -0.009767 0.014796 0.213650 0.208750 0.237053 0.241852
polarizability: 1.95915633e+02 8.69888453e-02 2.12503279e+02 1.60519351e+01 -1.45484705e-01 1.87549919e+02
1716.lowfreq: -7.7788 -7.2133 -0.0019 -0.0009 0.0011 6.1193 32.7343 35.7659 49.8817
frequency: 32.6720 35.6316 49.8764 65.9827 69.8675 74.5846 77.9423 82.1136 98.9371 101.4879 115.3093 124.7256 131.3881 144.6515 155.4410 162.2582 167.3542 178.5495 180.2112 199.6411 223.7734 230.7479 255.8962 266.0024 306.1331 320.9481 340.8363 346.1936 372.5959 455.7771 489.8330 545.8692 575.9624 589.4341 598.2064 627.8792 643.0618 713.1706 728.5850 766.8272 789.3390 811.8430 844.1417 846.1586 899.9842 938.5728 959.4777 976.9089 992.2722 1017.6625 1045.5830 1057.4796 1108.4517 1113.9040 1114.7953 1133.1264 1148.5870 1152.1903 1164.1820 1183.9445 1210.4885 1248.1422 1316.7628 1344.2950 1421.0177 1423.0096 1452.2138 1454.1297 1460.2284 1463.1473 1609.8755 1633.3012 1647.7521 3002.5414 3008.4334 3010.7803 3095.9101 3112.5423 3115.7909 3155.2392 3160.1039
redmass: 6.6472 4.9377 5.8546 8.6949 9.1845 6.3256 6.6651 17.0186 1.1082 1.2851 7.4947 25.3649 21.5052 8.2037 33.2004 15.1931 26.8781 5.4003 13.4402 8.0586 8.5940 8.1683 6.9183 12.2983 7.4120 11.8617 12.3286 8.1876 13.1892 8.4133 8.8331 8.3951 6.9638 8.7475 9.3322 9.7058 6.8428 6.9411 6.5745 8.2681 8.8389 7.8485 9.9615 8.8552 8.8860 8.4723 8.8831 5.6755 7.5012 10.1078 4.7057 6.7607 4.0092 1.2795 1.2794 9.9830 1.4951 1.4654 2.9787 6.8424 1.4174 1.4484 1.3080 1.5313 1.1716 1.1977 1.0499 1.0493 1.0504 1.0506 12.0061 8.9783 10.7697 1.0822 1.0294 1.0294 1.0842 1.1048 1.1050 1.1052 1.1052
irintensity: 1.2990 1.5390 0.4333 0.5879 0.7210 0.1070 0.0843 0.0064 0.1032 0.2981 1.6258 0.2117 0.0800 0.3191 0.1079 0.6345 0.1025 6.1340 0.5883 1.3093 0.6238 3.4666 9.5840 0.5410 17.9917 1.4921 4.5884 5.3019 1.6912 29.3914 13.9740 37.9049 22.9258 11.2484 37.4933 5.3006 14.0127 0.6300 30.2946 54.8828 42.2484 15.9009 5.1072 14.6883 3.3029 2.7511 15.1639 25.6414 32.6304 35.6715 14.7589 21.1286 4.7165 0.4262 0.4215 59.3392 39.4715 4.7126 325.7037 182.9675 98.2020 26.5204 32.7417 49.7340 19.8229 24.4453 14.5776 15.6536 10.3757 10.8690 52.1929 156.1086 156.6774 13.6048 28.9542 27.0607 5.7580 18.0817 18.4774 10.8753 11.2506
temp: 298.150 k
press: 1.00000 atm
elementType: 35 35 17 17 17 17 8 8 8 8 6 6 6 6 6 6 6 6 6 6 6 1 1 1 1 1 1 1 1
symmnumber: 1
zpe: 450338.2 jmol-1
zpe.correction: 0.171525 hartree
zpe.thermalcorrener: 0.195166 hartree
zpe.thermalcorrenthalpy: 0.196110 hartree
zpe.thermalcorrgfe: 0.115339 hartree
zpe.sumelectzpe: -2590.396010 hartree
zpe.sumelectthermal: -2590.372369 hartree
zpe.sumelectthermalent: -2590.371424 hartree
zpe.sumelectthermalfe: -2590.452195 hartree
dipole: -4.4189 0.4047 -1.8914
dipole: 4.8237
quadrupole: -149.6616 -156.6905 -175.4677
quadrupole: -4.4032 4.9297 -3.8945
quadrupole: 10.9450 3.9161 -14.8611 -4.4032 4.9297 -3.8945
hfenergy: -2590.5675346 hartree
pointgroup: C01 [X(C11H8Br2Cl4O4)]
dipole: -0.1176371 -1.831033 0.484789 debye
polarizability: 211.8346458|1.5362307|200.2370666|4.1861582|-14.2165319|183.8971178 unknown
InChI: InChI=1S/C11H8Br2Cl4O4/c1-20-7(18)3-4(8(19)21-2)10(17)6(15)5(14)9(3,16)11(10,12)13/h3-4H,1-2H3
charge 0 multiplicity 1
29 atoms
Br -0.574003 3.31738 1.606684
Br 1.577019 1.031415 2.345118
Cl -2.007048 0.060519 2.347778
Cl 1.838828 2.631411 -0.995225
Cl -3.47852 0.849916 -0.613205
Cl -1.056745 2.387318 -2.703743
O  -1.504718 -2.743982 0.567328
O  2.440123 -1.683025 0.322311
O  -1.177645 -1.936086 -1.591673
O  3.291659 -0.09996 -1.152494
C  -0.99394 0.431207 0.867092
C  0.560763 1.440108 -0.461048
C  -0.139221 -0.792086 0.338012
C  0.87383 -0.113376 -0.650795
C  0.129017 1.52552 1.051966
C  -1.7437 1.039634 -0.326499
C  -0.81745 1.63731 -1.121531
C  -0.981896 -1.857706 -0.356764
C  2.329203 -0.571573 -0.515672
C  -2.401606 -3.795545 0.019366
C  3.806418 -2.250407 0.448235
H  0.377825 -1.250693 1.192756
H  0.586154 -0.367255 -1.690166
H  -3.261161 -3.328018 -0.488613
H  -2.721138 -4.371783 0.897775
H  -1.849677 -4.425943 -0.697035
H  4.475556 -1.512396 0.920997
H  4.200484 -2.515714 -0.546659
H  3.682087 -3.139289 1.081603
