program: Gaussian 09
title: 000283903
version: EM64L-G09RevD.01
frameworkgroup: C1[X(C16H22O3)]
method: RPBEPBE
basis: SDD
operation: Freq
keyword: #pfreq=noraman
keyword: PBEPBE/SDD
title: #p freq=noraman PBEPBE/SDD
converged: NO YES NO NO
title: Mulliken charges:
elementType: O O O C C C C C C C C C C C C C C C C H H H H H H H H H H H H H H H H H H H H H H
charge: -0.283082 -0.202021 -0.252145 0.350095 -0.155625 -0.352841 -0.159743 -0.506630 -0.436280 -0.466358 0.109666 -0.405866 -0.516927 -0.477826 -0.466300 -0.156862 -0.186795 0.276224 -0.767093 0.224031 0.286452 0.273323 0.269790 0.208390 0.185895 0.262267 0.209537 0.226343 0.225646 0.216342 0.256712 0.230684 0.202638 0.199214 0.200807 0.205630 0.213136 0.213210 0.254327 0.246409 0.245626
chargesum: 0.00000
title: Mulliken charges with hydrogens summed into heavy atoms:
elementType: O O O C C C C C C C C C C C C C C C C
charge: -0.283082 -0.202021 -0.252145 0.350095 0.068406 -0.066389 0.113580 -0.028450 0.011882 -0.030478 0.109666 0.036122 -0.029531 -0.075974 -0.059863 0.056274 0.026415 0.276224 -0.020731
polarizability: 1.80759954e+02 -4.31654069e+00 1.77817180e+02 1.42880972e+00 -1.06001160e+01 1.51660181e+02
1716.lowfreq: -52.2726 0.0008 0.0010 0.0011 4.0531 11.8471 14.7370 38.6306 55.6223
frequency: -52.2161 38.4703 55.5520 67.0119 75.2137 89.5757 120.1897 136.4340 171.7943 199.7818 210.2066 231.6531 253.9793 258.1421 303.0818 311.7691 336.7541 359.9085 375.4181 393.3466 435.9192 458.9710 470.2172 515.8818 528.3683 542.6981 570.3988 581.4502 592.6742 660.5449 689.5351 719.8781 731.4083 764.2418 784.4716 826.5491 846.0972 861.4109 868.4918 886.6725 896.0415 927.1298 934.9175 953.9995 966.1187 976.6396 985.5137 997.9658 1009.9508 1030.7596 1038.3410 1045.3898 1062.6933 1071.2990 1098.3681 1106.1679 1121.1956 1130.8013 1141.1793 1149.3361 1169.8619 1182.1067 1199.2768 1205.1135 1217.7432 1228.9901 1244.8906 1250.0980 1255.0004 1259.8391 1263.8299 1289.2102 1301.0419 1307.0328 1312.8449 1317.7041 1332.0072 1341.9574 1346.2998 1348.4885 1364.4568 1382.6539 1387.9308 1432.4072 1454.7975 1457.8687 1464.0159 1466.0839 1470.0003 1476.8587 1477.8571 1485.1828 1607.9033 1632.1867 1666.2018 2961.8614 2973.1534 2976.1356 2978.3424 2985.1987 2987.7164 2997.4947 2999.4022 3007.0037 3009.4872 3029.4231 3035.0036 3038.8630 3047.5558 3054.0996 3055.1634 3059.7073 3069.5253 3077.9723 3094.7322 3111.8113 3138.9986
redmass: 1.0684 4.6942 5.1239 4.4101 3.3560 4.2734 3.1723 3.8171 2.8006 2.9333 3.8358 4.6947 3.4955 3.0938 2.5848 2.2828 2.6601 2.9504 4.6413 2.7638 3.4484 2.9264 2.2538 3.4893 3.5725 2.6975 2.5637 2.7197 3.1556 4.4836 2.5878 3.0872 1.5191 2.6529 2.2431 2.0613 2.9921 2.0530 2.0645 2.6290 2.9443 2.9877 2.2202 2.4615 2.0562 1.3949 1.7431 1.8201 2.5069 2.3455 2.5770 1.6345 1.9509 2.2394 2.3573 1.2393 2.1255 1.8000 1.7040 1.4138 1.6451 1.8864 2.6153 1.2929 1.5846 1.6627 1.3132 1.6834 1.3664 1.2555 1.3688 1.4553 1.5243 1.2795 1.3715 1.3837 1.3844 1.5064 1.4714 1.4210 1.7201 1.2241 1.5041 1.0805 1.0665 1.0465 1.0858 1.0855 1.1078 1.0831 1.0851 1.0955 10.5113 10.6540 6.8111 1.0667 1.0597 1.0668 1.0650 1.0628 1.0733 1.0634 1.0621 1.0365 1.0860 1.0979 1.0987 1.0879 1.0990 1.0976 1.0983 1.0966 1.0993 1.0849 1.0972 1.0986 1.1012
irintensity: 1.3359 3.0242 2.4311 2.0889 3.3030 1.5969 1.3544 2.2849 0.6119 1.6887 3.0449 2.9579 1.2169 2.2647 1.4777 1.1013 1.6735 1.1552 4.9250 0.5816 2.0581 9.6023 1.5476 5.1971 9.8868 0.8304 3.3370 1.6498 4.7983 2.2443 1.3688 14.9196 58.5055 9.5503 1.4282 3.1900 3.4067 4.5177 5.5653 10.1806 20.4664 71.9997 9.0108 24.8183 2.5964 0.7134 7.3385 48.0892 6.4245 3.5352 6.0292 8.2502 6.7266 1.5229 16.8981 0.4373 11.3361 17.2548 4.2429 14.2253 74.4653 85.9935 253.1975 5.1987 22.3022 11.7048 8.9345 30.1989 9.4500 2.8022 11.3992 0.1020 1.5705 0.7443 8.1745 5.0162 2.4978 4.4392 1.5790 12.9012 4.0505 51.3942 1.6562 15.8182 14.0857 15.3057 1.5919 3.7067 3.7238 20.0741 14.2295 27.9985 174.7101 144.8453 3.7211 10.0023 29.9376 7.6815 27.8067 14.2828 56.9133 25.3286 22.6338 3.9779 4.7289 21.2739 32.9696 12.5756 36.0848 30.7689 22.4797 20.1265 24.7520 14.7724 6.3079 65.0393 8.1832
temp: 298.150 k
press: 1.00000 atm
elementType: 8 8 8 6 6 6 6 6 6 6 6 6 6 6 6 6 6 6 6 1 1 1 1 1 1 1 1 1 1 1 1 1 1 1 1 1 1 1 1 1 1
symmnumber: 1
zpe: 910695.3 jmol-1
zpe.correction: 0.346866 hartree
zpe.thermalcorrener: 0.364327 hartree
zpe.thermalcorrenthalpy: 0.365271 hartree
zpe.thermalcorrgfe: 0.301820 hartree
zpe.sumelectzpe: -847.091505 hartree
zpe.sumelectthermal: -847.074044 hartree
zpe.sumelectthermalent: -847.073100 hartree
zpe.sumelectthermalfe: -847.136551 hartree
dipole: 0.8563 -1.5487 0.8277
dipole: 1.9537
quadrupole: -106.3802 -131.7239 -108.7138
quadrupole: -2.5874 -1.1250 12.1497
quadrupole: 9.2258 -16.1179 6.8922 -2.5874 -1.1250 12.1497
hfenergy: -847.4383709 hartree
pointgroup: C01 [X(C16H22O3)]
dipole: -0.3084447 0.6537699 0.2612397 debye
polarizability: 180.2616752|-4.7178622|179.9844065|0.3466238|8.0376934|149.991234 unknown
InChI: InChI=1S/C16H22O3/c1-11(17)19-16-10-6-9-14(18)15(16)12-7-4-2-3-5-8-13(12)16/h2-3,12-13,15H,4-10H2,1H3
charge 0 multiplicity 1
41 atoms
O  -1.965364 0.748405 -0.879082
O  -0.742924 -3.609395 -0.598898
O  -1.696151 2.887717 0.029081
C  -0.937501 0.149451 0.044151
C  0.533279 0.701058 -0.096624
C  -0.479204 -1.207244 -0.565821
C  1.019419 -0.794099 -0.239555
C  -1.529466 0.026382 1.459122
C  1.121259 1.602505 1.003347
C  2.080564 -1.161418 -1.291294
C  -0.999787 -2.520495 -0.012084
C  -2.534248 -1.144288 1.530534
C  -1.807994 -2.489296 1.288409
C  2.614942 1.989985 0.777869
C  3.351443 -0.258718 -1.232933
C  3.595949 0.855705 1.043179
C  3.930914 -0.127451 0.162096
C  -2.252867 2.111288 -0.782876
C  -3.308147 2.511699 -1.793932
H  0.620807 1.207003 -1.080342
H  -0.613981 -1.204537 -1.662592
H  1.323446 -1.174368 0.753771
H  -1.989892 0.986109 1.750595
H  -0.708956 -0.161539 2.178405
H  1.037713 1.101511 1.988268
H  0.506269 2.520196 1.053664
H  1.642164 -1.072527 -2.305547
H  2.360444 -2.225211 -1.163002
H  -3.329167 -1.000432 0.773641
H  -3.028009 -1.163372 2.519808
H  -2.500336 -3.350093 1.278066
H  -1.095505 -2.67255 2.12178
H  2.855165 2.835755 1.449813
H  2.729187 2.371088 -0.256685
H  3.082058 0.743283 -1.61884
H  4.108246 -0.675291 -1.925045
H  4.043728 0.82958 2.047876
H  4.631328 -0.911603 0.485487
H  -3.653687 1.647504 -2.378812
H  -2.891258 3.276701 -2.472262
H  -4.16178 2.973803 -1.268337
