program: Gaussian 09
title: 000283897
version: EM64L-G09RevD.01
frameworkgroup: C1[X(C10H10OS3)]
method: RPBEPBE
basis: SDD
operation: Freq
keyword: #p
keyword: freq=noraman
keyword: PBEPBE/SDD
title: #p freq=noraman PBEPBE/SDD
converged: YES YES NO NO
title: Mulliken charges:
elementType: S S S O C C C C C C C C C C H H H H H H H H H H
charge: 0.097540 0.159483 -0.105877 -0.262096 0.316069 0.442770 -0.333836 -0.359181 -0.433317 -0.354157 -0.806097 0.126627 -0.045152 -0.573386 0.220816 0.278563 0.232730 0.233464 0.235677 0.226457 0.234603 0.242775 0.087054 0.138470
chargesum: 0.00000
title: Mulliken charges with hydrogens summed into heavy atoms:
elementType: S S S O C C C C C C C C C C
charge: 0.097540 0.246537 0.032593 -0.262096 0.316069 0.442770 -0.113019 -0.080618 -0.200587 -0.120693 -0.109360 0.126627 0.197623 -0.573386
polarizability: 2.85333016e+02 1.01878990e+01 2.02164316e+02 4.16278660e-01 1.07275799e+00 7.24574226e+01
1716.lowfreq: -7.7284 -1.3735 -0.0022 -0.0019 -0.0019 4.5722 25.5788 38.1071 43.4598
frequency: 25.4089 38.0210 43.4370 47.9925 58.8257 112.6674 136.2440 155.7699 181.2796 240.6503 268.3177 284.1088 290.5309 328.5588 349.3044 353.2751 403.3395 426.0126 444.3254 468.9282 523.7274 576.2117 632.3402 635.2190 687.3522 726.9175 735.5469 758.0888 798.0393 833.6560 842.1269 868.8349 872.8059 962.7641 984.6978 989.8188 1002.7380 1010.3793 1047.4578 1057.6729 1125.7015 1196.2159 1221.7416 1242.1731 1300.5902 1334.9034 1371.5301 1397.6728 1410.8380 1466.4302 1469.4321 1479.9940 1505.4527 1567.2125 1589.9119 1620.5874 2215.9520 2397.9996 2978.2691 3056.4792 3087.9121 3124.4551 3126.3122 3148.7221 3157.8134 3161.1791
redmass: 3.8051 1.5689 9.6161 2.0632 8.1805 4.4332 6.5585 5.1348 9.4268 7.2900 1.3326 2.4524 7.8285 10.2672 2.8165 1.5779 2.7744 22.5075 6.4125 3.2261 3.0906 6.6953 6.2349 6.9158 3.3909 5.3107 2.3024 1.1023 4.9285 1.3798 1.5403 1.5174 2.7922 1.3766 1.5039 1.4622 1.3577 2.9727 1.5819 2.8580 1.3299 1.1295 3.1400 1.7967 1.6412 1.8147 4.2578 1.2515 3.7835 2.0735 1.0460 1.9369 2.6283 6.3744 6.5483 6.3066 1.0376 1.0390 1.0374 1.0973 1.0988 1.0889 1.0882 1.0941 1.0907 1.0941
irintensity: 0.0171 2.2925 0.7046 0.8359 0.7920 2.9607 1.2046 3.6181 5.2299 4.6468 21.8452 11.4923 0.1977 3.9336 7.7516 7.6032 0.0036 5.1696 3.3037 1.7004 33.9046 45.6580 13.4359 5.4367 4.1210 19.2321 6.2951 1.8313 1.0178 54.5572 21.8344 1.4870 1.3302 1.1076 15.1805 21.7687 2.0175 13.5136 13.8788 28.2862 28.5852 43.6766 31.7559 139.6845 54.7289 97.2103 8.5739 14.4921 3.3456 29.0092 13.5956 130.1321 2.0488 305.2761 279.2054 48.4230 149.1184 17.7283 31.0832 17.9971 18.5804 13.0734 24.1675 12.1348 9.9142 2.0226
temp: 298.150 k
press: 1.00000 atm
elementType: 16 16 16 8 6 6 6 6 6 6 6 6 6 6 1 1 1 1 1 1 1 1 1 1
symmnumber: 1
zpe: 436391.0 jmol-1
zpe.correction: 0.166213 hartree
zpe.thermalcorrener: 0.181754 hartree
zpe.thermalcorrenthalpy: 0.182699 hartree
zpe.thermalcorrgfe: 0.120371 hartree
zpe.sumelectzpe: -1655.422284 hartree
zpe.sumelectthermal: -1655.406742 hartree
zpe.sumelectthermalent: -1655.405798 hartree
zpe.sumelectthermalfe: -1655.468125 hartree
dipole: 1.0786 3.2267 1.2481
dipole: 3.6239
quadrupole: -83.6158 -103.9775 -107.8776
quadrupole: 3.2880 -3.8167 3.6276
quadrupole: 14.8745 -5.4872 -9.3873 3.2880 -3.8167 3.6276
hfenergy: -1655.5884961 hartree
pointgroup: C01 [X(C10H10O1S3)]
dipole: 0.4365765 1.2797003 0.4522986 debye
dipolederiv: -0.4103365 0.1972568 -0.0037027 0.0780075 0.211839 0.0351386 -0.014141 0.1250308 -0.0212582 0.4540639 -0.1396508 0.0169808 -0.5596678 -0.3885807 -0.0021509 0.0579992 0.0272536 0.0068988 -0.1649689 -0.0238339 -0.0182938 0.0896524 -0.2621648 -0.0279407 -0.0107252 -0.1218534 0.2107297 -1.0148607 -0.0395577 -0.011589 0.0047237 -0.7099972 0.0238548 -0.0281868 0.0265167 -0.3243832 -0.9145894 -0.1735842 -0.0169328 -0.282945 -0.1312843 -0.00068 -0.0129579 0.0023095 -0.0103837 0.5722508 0.131311 0.0133056 0.1300322 0.0663893 -0.0024885 0.0103708 -0.0025358 -0.0105767 0.1507068 -0.0069001 0.0168102 0.2510022 0.0483694 -0.0086557 0.0009791 -0.0174952 -0.1159736 0.1988303 0.1155419 0.0025777 -0.1665068 0.0391332 -0.0201403 0.0248006 -0.0074284 -0.1034171 -0.4791487 -0.0104112 -0.01031 0.1885484 0.1224493 -0.0225134 -0.0355626 -0.0309785 -0.1712814 -0.2048965 -0.2053571 0.0214466 -0.4377914 -0.0660761 -0.0288206 0.0410098 -0.0204702 -0.1743508 -0.284258 -0.0764943 -0.0066171 0.0637447 0.0980257 -0.001615 -0.0128737 -0.0061115 0.0558078 2.3757469 0.1471649 0.054667 -0.2240534 0.6973597 -0.040127 0.1054109 -0.0308684 0.1946295 -1.8319596 0.176117 -0.0553741 0.1653451 -0.2666948 0.0050859 -0.0974259 0.0177024 -0.1686731 1.4420698 -0.1483335 0.0484947 0.4928702 0.5480778 -0.0387545 0.0276337 -0.050525 -0.1663449 -0.0058317 0.1012497 -0.0199016 0.1312028 0.0131227 0.0176226 -0.0217008 0.0152881 0.1362404 0.1696936 -0.0570066 0.0043644 -0.0082165 -0.0007673 0.0156148 0.0046218 0.0112555 0.1500015 0.0416059 -0.0548975 0.0007256 -0.0867095 -0.1031 0.0226905 0.0023407 0.0223858 0.1500046 -0.0753472 0.1016023 -0.0204567 0.108149 0.0093398 0.0188001 -0.0218931 0.0190431 0.1445215 -0.0402083 0.0047451 0.0721757 0.0091342 0.0472214 -0.0918967 0.1304806 -0.0578314 -0.0140708 0.0664294 0.0333156 -0.0049181 -0.0983538 -0.1439544 0.0176575 0.0051579 0.0234143 0.1076115 -0.0199591 -0.0116932 -0.0701958 -0.0200949 0.0693479 0.0766763 -0.1316338 0.0410524 -0.0559108 0.1305833 -0.0412895 -0.0035644 -0.0301336 0.0087395 0.013957 -0.0044301 0.0078881 0.1650786 -0.3240372 0.0537775 -0.0108174 0.2163302 0.071195 0.0120418 -0.0257892 -0.0013804 0.1472376 0.1684212 -0.0730723 0.0011251 -0.0142699 0.0220098 0.0266434 0.006515 0.0083379 -0.1321371 unknown
polarizability: 285.4840659|8.5429199|201.6227125|7.2823427|-4.1187085|72.8479752 unknown
InChI: InChI=1S/C10H10OS3/c1-7-2-4-8(5-3-7)9(11)6-10(12)14-13/h2-6,12-13H,1H3
charge 0 multiplicity 1
24 atoms
S  -4.491776 0.780475 -0.322363
S  -3.499244 -2.064716 -0.086367
S  -3.65401 2.902114 -0.286982
O  -0.81198 -2.0862 0.040548
C  0.805616 -0.292531 -0.021678
C  3.538809 0.572843 0.029826
C  1.133687 1.084142 -0.142227
C  1.865572 -1.229792 0.12359
C  2.480211 1.504988 -0.116778
C  3.204268 -0.80474 0.149617
C  4.987397 1.023285 0.055841
C  -0.597459 -0.821502 -0.042467
C  -1.724847 0.111921 -0.157237
C  -3.026135 -0.312513 -0.179437
H  0.351482 1.840707 -0.262678
H  1.601609 -2.288757 0.213228
H  2.713926 2.571809 -0.213689
H  4.006617 -1.54405 0.263209
H  5.561535 0.567959 -0.77307
H  5.075283 2.11926 -0.034513
H  5.483576 0.719138 0.996585
H  -1.543693 1.187543 -0.234537
H  -4.883873 -1.791243 -0.136156
H  -3.677367 3.033361 1.098034
