program: Gaussian 09
title: 000283880
version: EM64L-G09RevD.01
frameworkgroup: C1[X(C9H15N)]
method: RPBEPBE
basis: SDD
operation: Freq
keyword: #pfreq=noraman
keyword: PBEPBE/SDD
title: #p freq=noraman PBEPBE/SDD
converged: YES YES NO NO
title: Mulliken charges:
elementType: N C C C C C C C C C H H H H H H H H H H H H H H H
charge: -0.023181 -0.087551 -0.040365 -0.028149 -0.469333 -0.460530 -0.749816 -0.514399 -0.767891 -0.153413 0.188806 0.234260 0.211617 0.216622 0.226105 0.211165 0.213120 0.212430 0.212777 0.223962 0.245398 0.252537 0.215556 0.221215 0.209060
chargesum: 0.00000
title: Mulliken charges with hydrogens summed into heavy atoms:
elementType: N C C C C C C C C C
charge: -0.023181 0.101255 0.193895 0.183468 -0.026607 -0.036245 -0.100647 -0.016464 -0.122060 -0.153413
polarizability: 1.20262095e+02 -4.93983175e+00 9.29962760e+01 -3.44026216e+00 1.40974435e+00 7.69633258e+01
1716.lowfreq: -12.2117 -7.4604 -0.0007 -0.0007 0.0001 17.5505 27.5181 56.7224 79.8784
frequency: 27.0418 56.6889 79.8617 123.9248 194.7058 217.3250 228.3495 252.1529 299.0083 371.0529 376.3722 407.7234 422.9403 504.9856 560.2120 614.3889 762.1945 811.5579 819.8963 878.9293 889.3574 930.6841 946.6405 980.7168 1003.6750 1015.8505 1051.4331 1063.0691 1105.1619 1119.5090 1142.8904 1158.6606 1169.5334 1216.8916 1220.3222 1254.3712 1274.0931 1280.1696 1287.4400 1301.5764 1304.6840 1325.9459 1339.0772 1351.4854 1381.9512 1393.6866 1441.6081 1468.7287 1471.0341 1472.3735 1477.6461 1486.0682 1487.6063 2194.7989 2930.7696 2953.7846 2967.6820 2969.4091 2974.9309 2983.5369 2986.5696 3002.7484 3039.1906 3046.8969 3058.3927 3061.7597 3064.9371 3069.2675 3073.5450
redmass: 1.8108 4.1208 3.5686 3.9331 1.0842 1.0497 3.4705 2.2729 2.3789 3.5113 2.7840 2.5168 3.5623 2.8005 3.8474 3.9285 1.5770 1.6154 2.3999 1.7703 1.6226 3.5780 1.3100 1.3355 2.7758 1.7885 1.7711 2.6235 2.4531 2.2920 2.0288 2.0809 1.4052 1.3121 1.5321 1.2152 1.2617 1.3009 1.2679 1.2815 1.3868 1.4507 1.5663 1.5711 1.2197 1.2109 1.0846 1.0698 1.0601 1.0514 1.0496 1.0492 1.0859 12.4285 1.0804 1.0846 1.0361 1.0378 1.0748 1.0658 1.0639 1.0646 1.1000 1.1006 1.0991 1.0991 1.0989 1.0981 1.1013
irintensity: 0.7064 3.9632 2.6366 3.7800 0.0487 0.1000 0.3032 0.1046 0.7390 0.4546 0.4258 1.0261 0.1181 0.6333 0.5101 3.1627 3.2700 2.0058 0.1380 2.3795 0.1934 3.1770 3.8623 11.8539 3.9768 3.3715 1.1419 0.2037 0.8416 1.5457 3.1340 1.5693 0.0820 0.6478 1.5326 1.5864 2.3582 1.5628 1.7232 2.0707 2.6803 0.9563 2.0539 1.4100 13.6244 15.7509 10.4537 7.1782 4.9571 5.7580 15.4841 8.5194 14.4664 17.1042 5.0022 20.6972 31.6420 29.6077 23.2835 22.9507 36.9190 50.5048 12.1233 4.2885 25.8755 49.6146 34.6305 36.4835 84.9030
temp: 298.150 k
press: 1.00000 atm
elementType: 7 6 6 6 6 6 6 6 6 6 1 1 1 1 1 1 1 1 1 1 1 1 1 1 1
symmnumber: 1
zpe: 575412.6 jmol-1
zpe.correction: 0.219163 hartree
zpe.thermalcorrener: 0.230416 hartree
zpe.thermalcorrenthalpy: 0.231360 hartree
zpe.thermalcorrgfe: 0.181352 hartree
zpe.sumelectzpe: -405.906638 hartree
zpe.sumelectthermal: -405.895385 hartree
zpe.sumelectthermalent: -405.894441 hartree
zpe.sumelectthermalfe: -405.944449 hartree
dipole: -4.1254 1.3019 0.8989
dipole: 4.4183
quadrupole: -84.5044 -61.3086 -60.5738
quadrupole: 4.6028 3.4902 0.2920
quadrupole: -15.7088 7.4870 8.2218 4.6028 3.4902 0.2920
hfenergy: -406.125801 hartree
pointgroup: C01 [X(C9H15N1)]
dipole: 1.6317489 -0.4868836 0.3493078 debye
dipolederiv: -0.3867235 -0.0126396 0.0060817 0.0700592 -0.2334577 -0.0048445 -0.0662879 -0.0072244 -0.2363584 0.0156778 -0.0275426 0.0000306 -0.0793556 0.0390897 0.0432381 0.0469593 -0.0141834 0.1550853 0.14395 0.0382381 -0.0461127 0.1186359 0.0353812 0.0183349 -0.0616716 0.0385159 0.140836 0.0481463 0.0120445 0.0275637 0.0262053 0.0541579 0.0115259 -0.0774521 -0.0084039 0.1658544 -0.0234778 -0.0248858 0.0169417 0.0000443 -0.0200076 -0.0181442 -0.0248479 -0.0066664 0.135861 -0.0134295 0.0426118 0.0039868 0.0310923 0.0138846 -0.0310555 0.0503037 0.0051525 0.1480277 0.0151642 0.02791 0.0031207 0.0367045 -0.0673805 -0.0348434 -0.0112687 -0.0013367 0.0893703 -0.0778973 0.0304351 -0.0221029 0.0279355 0.1272572 0.0554345 -0.0137111 0.0496311 0.2072011 -0.0680562 0.0065474 -0.0400442 -0.011882 0.0466016 0.0071561 -0.0000111 0.0171175 0.0859963 0.2054384 -0.0691556 0.0717475 -0.1653473 -0.0261742 -0.0244951 0.1567493 -0.0121722 -0.0482967 0.0375954 0.005375 0.006716 0.0068159 0.0199081 -0.0451172 -0.0000518 -0.0092591 -0.1948275 0.0351166 -0.007059 0.0139059 -0.0219635 0.0191563 -0.0408604 -0.0106363 -0.0442127 -0.1458568 0.0273707 -0.0004051 -0.0362668 0.0076922 0.0203048 -0.0509479 0.0123292 -0.0341901 -0.1867264 -0.0006175 0.0217807 0.0660472 0.0091959 0.0498745 -0.0121468 0.1127425 -0.0698137 -0.1156599 -0.0269018 0.0699688 -0.0659751 0.0708406 -0.016038 0.0547875 -0.0895493 0.0892507 -0.0035402 0.0195061 -0.0442465 0.0402089 -0.0594518 -0.0848226 0.0915197 0.0542363 0.1386562 -0.0248767 -0.0018955 -0.0488999 -0.0604477 -0.0288683 0.0310994 -0.0415978 -0.0852377 -0.1133303 -0.108385 -0.0330872 -0.1643907 0.0648534 -0.1215743 -0.0535068 0.0352805 0.0725271 0.0535666 0.0470163 0.0901662 -0.0000403 -0.0238637 0.0051152 0.0664983 0.0444267 -0.0026577 -0.0458321 -0.1583355 -0.1367848 0.131871 -0.0522 0.0785405 0.0530437 0.0062693 -0.0563528 0.0118448 0.0672735 0.0396567 0.018778 -0.048725 0.0271153 0.0959858 -0.0518556 -0.0088013 -0.0027094 -0.0723503 0.0606225 -0.0089548 -0.0197971 -0.029657 -0.0907311 -0.0051599 -0.0189621 -0.0298648 0.0955476 0.021334 0.0923623 0.006 0.159078 -0.1172364 -0.0439449 0.0082671 -0.0513372 0.0698118 -0.0536539 -0.0991411 0.0312638 -0.1600455 -0.0454042 0.0613742 0.0481666 0.0682862 0.055055 0.0627802 0.0094383 0.0570673 0.0030749 0.082516 -0.0243343 -0.0347818 -0.0214851 -0.1677226 unknown
polarizability: 120.4263932|-4.4878823|92.8552545|3.4334996|-1.190835|76.9400492 unknown
InChI: InChI=1S/C9H15N/c1-7-3-4-9(5-6-10)8(7)2/h7-9H,3-5H2,1-2H3
charge 0 multiplicity 1
25 atoms
N  -3.936096 0.26622 -0.257593
C  0.977239 -0.727161 0.20433
C  -0.390426 -0.121772 -0.223635
C  1.989839 0.328889 -0.328409
C  -0.237049 1.407417 0.034872
C  1.298741 1.695603 -0.030936
C  1.229514 -2.160285 -0.299566
C  -1.598491 -0.765162 0.508392
C  3.40746 0.215163 0.26101
C  -2.89493 -0.201339 0.092101
H  1.029583 -0.717328 1.317025
H  -0.513454 -0.297837 -1.312557
H  2.051776 0.194827 -1.430419
H  -0.638002 1.662143 1.034861
H  -0.813242 2.000187 -0.696431
H  1.551198 2.450539 -0.796796
H  1.659458 2.090038 0.938509
H  0.490511 -2.878885 0.102364
H  1.174958 -2.201765 -1.404701
H  2.22974 -2.521289 0.001958
H  -1.48793 -0.620562 1.601785
H  -1.622921 -1.857009 0.325797
H  3.878934 -0.755238 0.017982
H  4.066856 1.011366 -0.131726
H  3.380736 0.315839 1.363484
