program: Gaussian 09
title: 000283908
version: EM64L-G09RevD.01
frameworkgroup: C1[X(C16H28O4)]
method: RPBEPBE
basis: SDD
operation: Freq
keyword: #pfreq=noraman
keyword: PBEPBE/SDD
title: #p freq=noraman PBEPBE/SDD
converged: YES YES NO NO
title: Mulliken charges:
elementType: O O O O C C C C C C C C C C C C C C C C H H H H H H H H H H H H H H H H H H H H H H H H H H H H
charge: -0.313214 -0.268688 -0.268699 -0.294325 0.274490 0.317562 0.262483 0.254724 -0.573104 -0.602297 0.420230 0.396983 -0.777387 -0.780103 -0.767677 -0.734439 -0.745881 -0.739058 -0.748844 -0.725890 0.246561 0.230660 0.248993 0.220304 0.229917 0.237166 0.221115 0.221753 0.236843 0.222268 0.219465 0.274104 0.244288 0.209019 0.225302 0.255278 0.219081 0.233243 0.206308 0.225654 0.250796 0.200043 0.221979 0.252850 0.204393 0.207109 0.218316 0.230326
chargesum: 0.00000
title: Mulliken charges with hydrogens summed into heavy atoms:
elementType: O O O O C C C C C C C C C C C C C C C C
charge: -0.313214 -0.268688 -0.268699 -0.294325 0.274490 0.317562 0.262483 0.254724 -0.095883 -0.133000 0.420230 0.396983 -0.089189 -0.099239 -0.029820 -0.044840 -0.087249 -0.062565 -0.069621 -0.070139
polarizability: 2.17369732e+02 5.02188083e-01 1.74774870e+02 7.17740785e-01 9.28151455e-01 1.53956049e+02
1716.lowfreq: -14.0710 -5.3324 0.0007 0.0007 0.0011 6.6041 51.4600 57.0231 79.3025
frequency: 51.4414 56.9160 79.2779 123.8854 137.6110 172.4990 198.1841 200.8133 204.8513 214.6571 219.1686 227.9067 231.4962 244.1237 247.0272 255.0789 264.6931 268.5163 287.5423 292.6977 300.1540 312.0910 322.0948 326.6883 336.0235 347.0863 376.1430 386.1768 402.2944 433.0523 444.8074 478.9960 493.9760 501.3633 509.1715 549.6712 558.8037 588.7263 602.2178 634.9058 669.2855 716.7889 763.4552 768.9794 780.7157 819.7353 823.2165 853.1789 866.5417 873.2941 900.6059 912.4927 916.6530 919.5355 925.4700 931.9590 945.6752 952.0715 971.6542 979.2081 994.6955 997.4815 1038.4852 1043.3868 1069.1123 1075.7500 1088.9676 1113.8783 1120.5962 1140.7406 1156.5861 1157.7261 1170.4679 1182.0663 1191.5353 1219.1945 1232.2490 1236.1021 1260.1624 1273.1131 1276.7235 1280.6171 1299.3253 1310.7376 1369.0447 1372.3750 1376.4979 1380.1403 1387.0754 1388.4530 1389.1694 1392.1212 1447.1967 1449.3304 1449.7830 1452.1964 1455.5369 1457.4296 1460.2964 1462.0022 1464.8231 1466.7877 1468.8229 1471.7587 1476.3147 1477.1492 1481.4448 1487.1015 1489.5025 1493.8577 2978.6391 2980.7554 2984.3223 2985.1011 2992.5550 2995.6467 3000.8188 3012.5399 3015.1888 3034.2793 3072.6412 3077.0318 3078.2639 3082.8529 3083.0199 3087.8249 3090.1596 3091.3632 3094.3917 3095.6981 3100.6143 3101.8393 3102.5383 3105.1195 3110.3742 3113.2506 3121.4372 3143.9053
redmass: 3.0978 3.2206 3.5066 3.3427 2.8561 2.8987 1.6309 1.0437 1.1823 1.2822 2.3368 1.3722 1.2903 1.1703 1.6481 1.4552 1.4743 2.1333 1.7794 1.7048 2.0724 2.6884 2.6165 2.4439 3.0699 3.7214 2.5008 2.7071 2.8644 2.4243 2.8860 3.4292 4.0178 3.5240 2.9530 3.9752 3.7032 4.2879 4.0801 4.6597 4.4535 4.6847 4.1962 3.3174 4.5429 2.8994 2.9790 2.6053 2.5629 2.3744 2.1511 1.8910 2.0488 2.4670 1.5448 1.4532 2.3384 2.8113 1.6405 1.8189 1.3179 1.3608 1.5902 1.6820 1.6776 1.9529 1.8118 2.2956 3.5585 2.2326 2.3551 2.2782 2.3869 2.4963 2.7739 3.5852 3.1840 3.2272 3.6501 3.2097 2.1673 2.1672 1.8373 1.7347 1.2481 1.2431 1.2397 1.2386 1.2106 1.2189 1.2208 1.2419 1.0544 1.0523 1.0515 1.0696 1.0556 1.0619 1.0510 1.0525 1.0569 1.0600 1.0603 1.0593 1.0512 1.0527 1.0562 1.0521 1.0522 1.0643 1.0357 1.0358 1.0361 1.0359 1.0360 1.0351 1.0356 1.0620 1.0366 1.0680 1.0989 1.0986 1.1000 1.0992 1.0994 1.0994 1.0995 1.1000 1.0998 1.1005 1.0997 1.0997 1.0998 1.1001 1.0994 1.0996 1.0953 1.0984
irintensity: 0.2778 0.2047 0.0386 4.2473 1.5741 3.3586 0.0464 0.2581 0.1311 0.0678 0.3939 0.0730 0.6726 0.8268 0.6569 1.3181 0.4567 1.1334 1.8005 0.1094 0.8421 0.6548 1.7530 1.7315 2.5046 1.5589 0.3545 2.2634 4.9348 4.0330 1.2811 0.0905 7.1272 7.9342 0.0682 8.2267 1.1586 1.9899 2.5098 1.3062 9.9694 5.9460 20.0107 35.1428 12.0362 5.7915 161.2883 2.8576 65.8070 57.2100 75.0574 1.9402 2.8204 4.6578 12.3710 2.0924 17.9009 63.4606 1.6524 6.9807 1.5309 4.2354 16.8033 17.7339 69.3275 101.7390 10.2466 41.5170 106.4244 65.3109 46.4764 67.2706 24.4981 2.8088 49.1755 3.1525 9.7844 14.9413 17.7622 18.4665 21.9554 2.6753 27.3081 27.0253 15.7471 10.9568 16.1821 45.3510 30.7090 27.0358 36.3101 30.5447 13.1903 1.8423 2.2834 2.4503 1.9829 12.8546 12.2821 3.9039 10.6346 4.8310 4.1745 3.2018 11.5539 6.7231 3.5740 14.4764 8.2148 6.6195 19.4431 19.6754 38.8403 26.3109 14.2014 15.7741 14.2213 33.4011 17.4315 19.7307 5.9591 6.7469 21.3453 42.8266 35.0296 17.9456 36.4120 34.0596 18.0386 19.3027 18.0938 68.9618 7.8998 24.6214 13.8762 13.0801 11.6024 3.6563
temp: 298.150 k
press: 1.00000 atm
elementType: 8 8 8 8 6 6 6 6 6 6 6 6 6 6 6 6 6 6 6 6 1 1 1 1 1 1 1 1 1 1 1 1 1 1 1 1 1 1 1 1 1 1 1 1 1 1 1 1
symmnumber: 1
zpe: 1084423.4 jmol-1
zpe.correction: 0.413035 hartree
zpe.thermalcorrener: 0.434858 hartree
zpe.thermalcorrenthalpy: 0.435803 hartree
zpe.thermalcorrgfe: 0.366592 hartree
zpe.sumelectzpe: -925.786833 hartree
zpe.sumelectthermal: -925.765009 hartree
zpe.sumelectthermalent: -925.764065 hartree
zpe.sumelectthermalfe: -925.833276 hartree
dipole: -0.7057 0.8352 3.0957
dipole: 3.2832
quadrupole: -114.3820 -118.3515 -128.4051
quadrupole: -1.2100 2.1364 1.6523
quadrupole: 5.9976 2.0281 -8.0256 -1.2100 2.1364 1.6523
hfenergy: -926.1998676 hartree
pointgroup: C01 [X(C16H28O4)]
dipole: 0.2781828 -0.3046903 1.2240332 debye
polarizability: 217.3630701|0.7715551|174.7428182|-0.6419812|-1.3076087|153.9947631 unknown
InChI: InChI=1S/C16H28O4/c1-11(2)9-13(5)15(7,17-11)20-16(8)14(6,19-13)10-12(3,4)18-16/h9-10H2,1-8H3
charge 0 multiplicity 1
48 atoms
O  0.300207 0.508507 1.364627
O  -0.284567 -0.689548 -1.127522
O  -2.381659 0.378509 -1.171347
O  2.000737 0.097786 -1.085326
C  -1.006718 0.81033 0.730314
C  1.07844 -0.71214 0.987668
C  -1.004256 0.605282 -0.82387
C  1.035575 -0.90669 -0.564596
C  -2.182502 -0.111055 1.200813
C  2.542914 -0.300619 1.250037
C  -3.107017 -0.318688 -0.03677
C  3.009247 0.466258 -0.025896
C  -1.252034 2.273244 1.130353
C  0.635548 -1.939447 1.80523
C  -0.482499 1.713924 -1.731677
C  1.436633 -2.299102 -1.068658
C  -4.463214 0.396004 0.080961
C  -3.279371 -1.80094 -0.41845
C  2.965453 1.996648 0.143594
C  4.393411 0.001984 -0.51996
H  -1.795999 -1.073242 1.562761
H  -2.728415 0.36443 2.033788
H  2.602014 0.3276 2.154163
H  3.164582 -1.199907 1.40956
H  -1.276566 2.34972 2.231368
H  -0.445835 2.925382 0.755978
H  -2.215073 2.632524 0.727335
H  1.410594 -2.725438 1.77836
H  0.478336 -1.642812 2.85672
H  -0.297631 -2.383923 1.419839
H  -1.096544 2.623179 -1.623236
H  0.572045 1.929209 -1.511232
H  -0.550692 1.363341 -2.774511
H  2.428576 -2.590397 -0.682749
H  0.695264 -3.062963 -0.780312
H  1.488123 -2.255852 -2.168755
H  -4.332517 1.451818 0.377156
H  -4.985959 0.373944 -0.891285
H  -5.101864 -0.103481 0.832536
H  -3.882247 -1.890647 -1.339236
H  -2.293644 -2.25738 -0.608001
H  -3.791275 -2.35482 0.391345
H  3.110261 2.490513 -0.833866
H  1.995702 2.30491 0.56684
H  3.770041 2.332926 0.824176
H  5.169632 0.218527 0.238231
H  4.394519 -1.083695 -0.723184
H  4.662946 0.525383 -1.454013
