program: Gaussian 09
title: 000283877
version: EM64L-G09RevD.01
frameworkgroup: C1[X(C7H4Cl2O6S2)]
method: RPBEPBE
basis: SDD
operation: Freq
keyword: #p
keyword: freq=noraman
keyword: PBEPBE/SDD
title: #p freq=noraman PBEPBE/SDD
converged: YES YES NO NO
title: Mulliken charges:
elementType: Cl Cl S S O O O O O O C C C C C C C H H H H
charge: -0.160285 -0.162260 0.893266 0.892240 -0.436444 -0.432532 -0.435677 -0.435583 -0.428869 -0.211815 -0.063991 -0.064923 -0.214769 0.291612 -0.309533 -0.277645 0.143701 0.341734 0.330373 0.333865 0.407533
chargesum: 0.00000
title: Mulliken charges with hydrogens summed into heavy atoms:
elementType: Cl Cl S S O O O O O O C C C C C C C
charge: -0.160285 -0.162260 0.893266 0.892240 -0.436444 -0.432532 -0.435677 -0.435583 -0.021336 -0.211815 -0.063991 -0.064923 0.126965 0.291612 0.020840 0.056220 0.143701
polarizability: 2.12991465e+02 -1.99130248e+00 1.90291421e+02 -3.69366144e-02 -1.15369311e+00 1.45917560e+02
1716.lowfreq: -7.9683 -5.7527 -3.5001 -0.0014 0.0013 0.0020 13.4216 14.9731 47.8555
frequency: 12.7635 14.4248 47.8529 54.7502 72.4730 78.4821 101.5813 133.4990 162.7880 167.4652 187.4666 193.1385 203.6572 220.1244 240.5044 240.8081 250.3692 266.9175 364.2288 379.3868 387.9647 396.7390 428.4258 431.3363 476.3467 520.3767 547.0748 598.0734 610.8542 663.1696 696.1516 733.7335 787.8847 826.7306 829.3563 924.1864 959.3364 963.9980 965.8300 967.3825 971.6658 1031.2000 1079.2073 1086.4854 1145.3891 1243.3823 1318.9917 1380.5878 1405.4779 1437.5817 1554.6984 1599.7001 1649.7152 3146.0145 3155.7992 3174.3804 3536.4884
redmass: 21.9304 20.7198 17.1615 12.0731 18.4355 14.7545 11.0475 10.1383 9.4995 14.8222 9.5891 12.1918 6.6848 8.0528 12.3955 12.2030 11.7085 15.9608 10.2756 10.0125 13.4222 11.3880 12.3484 10.4820 4.4300 5.8485 6.5696 4.8088 1.3298 2.6512 10.1410 4.6165 8.4942 18.2404 17.4234 1.4233 1.5208 5.9038 2.5169 3.3709 7.4326 3.8285 1.6892 1.8132 1.9374 1.2018 2.3838 4.0753 4.6013 3.7665 7.9536 7.7461 9.9477 1.0937 1.0935 1.0936 1.0647
irintensity: 0.0582 0.3751 1.1440 1.4756 0.7016 4.0299 1.0672 2.5371 0.7869 0.4595 4.4333 2.7049 8.0652 0.8507 0.3823 0.2549 6.5587 3.3754 72.8392 29.6508 0.3902 72.1990 83.6564 103.1272 17.1212 3.6332 4.9394 46.8209 183.8208 0.2745 1.4863 35.5971 4.5370 38.4746 87.6915 12.4066 11.2673 31.7702 19.3272 16.9203 29.4112 269.2554 21.4775 1.5223 98.8952 2.7066 134.8949 21.1250 18.2921 7.7114 24.8834 1.3976 195.0858 31.4938 17.3568 18.1344 85.8194
temp: 298.150 k
press: 1.00000 atm
elementType: 17 17 16 16 8 8 8 8 8 8 6 6 6 6 6 6 6 1 1 1 1
symmnumber: 1
zpe: 281268.4 jmol-1
zpe.correction: 0.107129 hartree
zpe.thermalcorrener: 0.125662 hartree
zpe.thermalcorrenthalpy: 0.126606 hartree
zpe.thermalcorrgfe: 0.056214 hartree
zpe.sumelectzpe: -2435.161326 hartree
zpe.sumelectthermal: -2435.142793 hartree
zpe.sumelectthermalent: -2435.141849 hartree
zpe.sumelectthermalfe: -2435.212242 hartree
dipole: 1.4868 5.0441 0.0744
dipole: 5.2592
quadrupole: -156.8761 -124.0161 -132.4873
quadrupole: 9.6628 0.6948 -0.2371
quadrupole: -19.0829 13.7771 5.3058 9.6628 0.6948 -0.2371
hfenergy: -2435.2684552 hartree
pointgroup: C01 [X(C7H4Cl2O6S2)]
dipole: -0.6367161 -1.9657945 -0.1073156 debye
dipolederiv: -0.3473694 -0.0653113 -0.071615 -0.0728172 -0.2217021 -0.0103779 -0.2613864 -0.0949592 -0.6948632 -0.3394594 0.0782512 0.0729643 0.0819471 -0.2362832 -0.014386 0.2612762 -0.1294675 -0.6963844 1.5947608 0.308539 0.0904574 0.389134 1.0274332 0.0296608 0.1460204 0.0608268 1.5904721 1.5221999 -0.3382166 -0.0856421 -0.4260049 1.0832559 0.0366188 -0.1371005 0.0693645 1.5886243 -0.570918 -0.0573554 -0.0652873 -0.0983128 -0.4722766 0.1073393 0.021213 0.0513078 -0.4482334 -0.6058905 -0.0633058 0.0510008 -0.0596115 -0.4386662 -0.1211022 0.0716485 -0.0210248 -0.4669266 -0.6004601 0.0758998 -0.0643169 0.0683791 -0.4554146 -0.1184553 -0.0777064 -0.0100885 -0.4689233 -0.5548764 0.0645514 0.0731913 0.1098721 -0.4952896 0.1012188 -0.023223 0.0644918 -0.4470668 -0.9447525 -0.5581744 0.0071355 -0.4395519 -0.708315 -0.0165826 0.0306789 0.0244044 -0.3940362 -0.7041055 0.0814841 0.0027823 0.258218 -0.931228 -0.0032672 -0.0113519 0.040381 -0.2911411 0.112654 0.202931 0.0572824 0.127804 -0.0494951 0.0324513 0.0495156 0.0336944 -0.1424332 0.0962368 -0.2283776 -0.0535811 -0.1343414 -0.0233677 0.0379141 -0.0439907 0.0359376 -0.1433648 -0.1836417 -0.0159325 -0.0030375 -0.0051697 -0.2875009 -0.0376443 -0.0016032 -0.0398177 -0.0259016 -0.0453675 -0.0414177 -0.0022018 -0.0538325 -0.4542767 -0.0072927 0.0019009 0.034902 0.0516715 -0.2173552 -0.0650855 -0.0238464 0.0447709 -0.0056695 -0.0231381 -0.0404264 0.0025617 -0.0307585 -0.2486691 0.134555 0.0224347 -0.0356673 0.0300774 -0.0241523 0.039381 -0.0034284 -0.0313386 1.2224671 0.3398693 -0.0056882 0.1229892 1.8454991 -0.0125943 -0.0116587 -0.0982322 0.2407317 0.2358641 -0.0007751 0.0005379 -0.0025214 0.1584234 0.0005541 0.000439 0.0072552 0.1289924 0.1360296 0.0148726 0.004596 0.0360653 0.1994281 0.013995 -0.0010453 -0.0188294 0.1378426 0.1321677 -0.0255625 -0.0033377 -0.003024 0.2015159 0.0142875 -0.0059234 -0.0179113 0.1398476 0.3104852 0.1585613 -0.0038285 0.0916748 0.2338523 0.0149531 -0.0066577 0.0086319 0.4031894 unknown
polarizability: 212.8704571|-2.6017849|190.0491937|0.1442998|4.1557173|146.2807954 unknown
InChI: InChI=1S/C7H4O6S2.2Cl/c8-7(9)4-1-5(14(10)11)3-6(2-4)15(12)13;;/h1-3,8H;;
charge 0 multiplicity 1
21 atoms
Cl 3.357369 1.37692 2.104253
Cl -3.214853 1.673337 2.097217
S  2.883956 1.246393 -0.251605
S  -2.74969 1.501693 -0.258767
O  2.641003 2.742265 -0.811514
O  3.95033 0.231069 -0.914741
O  -3.900924 0.581747 -0.920471
O  -2.378579 2.969848 -0.821466
O  -1.389328 -3.654342 0.125252
O  0.930886 -3.878566 0.133032
C  1.204101 0.378931 -0.143579
C  -1.154241 0.487111 -0.14693
C  0.059347 1.189832 -0.188682
C  -0.072685 -1.663731 -0.008821
C  1.187976 -1.017091 -0.049879
C  -1.26905 -0.905533 -0.052901
C  -0.089356 -3.158407 0.088717
H  0.109889 2.281476 -0.278166
H  2.106767 -1.613859 -0.023351
H  -2.241778 -1.405867 -0.02983
H  -1.379641 -4.646726 0.191933
