program: Gaussian 09
title: 000283888
version: EM64L-G09RevD.01
frameworkgroup: C1[X(C12H17BrO2)]
method: RPBEPBE
basis: SDD
operation: Freq
keyword: #p
keyword: freq=noraman
keyword: PBEPBE/SDD
title: #p freq=noraman PBEPBE/SDD
converged: YES YES NO NO
title: Mulliken charges:
elementType: Br O O C C C C C C C C C C C C H H H H H H H H H H H H H H H H H
charge: -0.023410 -0.432536 -0.286851 -0.004364 -0.381676 -0.658561 0.543312 -0.706024 -0.712287 -0.008533 -0.438330 0.194472 -0.192609 -0.351630 -0.517722 0.182051 0.214586 0.231641 0.274698 0.201454 0.213233 0.222516 0.213731 0.213268 0.212004 0.215222 0.248944 0.260275 0.368930 0.230574 0.210977 0.262649
chargesum: 0.00000
title: Mulliken charges with hydrogens summed into heavy atoms:
elementType: Br O O C C C C C C C C C C C C
charge: -0.023410 -0.063607 -0.286851 0.177687 0.064550 -0.182409 0.543312 -0.056544 -0.071793 -0.008533 -0.438330 0.194472 0.056334 -0.091356 0.186478
polarizability: 1.97894586e+02 -1.66463350e+01 1.71678858e+02 9.26245450e+00 8.14523605e+00 9.68325930e+01
1716.lowfreq: -15.0716 -8.5467 -2.8562 0.0002 0.0004 0.0005 15.2068 24.7906 54.3858
frequency: 8.3098 24.5476 54.3726 58.7795 88.8019 109.4228 131.8751 155.0823 169.3200 207.1020 220.8308 239.3589 249.7174 253.0893 278.9432 292.9176 317.6456 355.4901 382.1350 388.9777 405.1719 432.1318 472.2597 537.6476 550.8559 602.6988 606.7779 669.3705 741.2876 771.2287 806.6829 811.4533 834.7430 895.3693 911.6848 926.4602 935.3382 949.3457 966.8922 992.5459 1030.2760 1077.1106 1112.5875 1123.6527 1126.8490 1154.6654 1162.9911 1175.6670 1196.8855 1206.4888 1222.5078 1259.1443 1272.6177 1278.8310 1310.3903 1331.0000 1342.4998 1376.1158 1381.7654 1393.2897 1406.2148 1429.6582 1450.5555 1458.7383 1463.3970 1468.5644 1476.5214 1480.3606 1481.7699 1488.8167 1501.1262 1581.3501 1597.8597 2936.4572 2939.1994 2965.2495 2968.5401 2973.0225 2977.4262 3025.6336 3061.0592 3065.6365 3068.5424 3070.6207 3074.5554 3088.4029 3130.8009 3162.6928 3182.9659 3578.6724
redmass: 2.5452 4.7661 3.5144 3.5490 2.3164 2.5065 3.9811 2.1869 2.2610 1.1582 3.6338 1.2762 2.9967 4.4418 1.7029 2.5193 3.6005 2.5672 2.6749 3.3874 3.1012 2.2854 4.7793 4.4165 4.7705 5.6266 4.8317 4.0645 5.1613 1.3438 1.4623 3.3878 3.7101 4.2279 1.1842 1.7335 1.3393 1.4017 1.9869 3.5804 3.1247 1.7198 1.2370 1.3602 2.3170 1.3476 2.7592 1.7546 1.7366 1.8556 2.1069 1.2692 1.8231 1.3274 1.4160 1.4184 1.5024 1.2728 4.1572 1.2206 5.4605 1.2735 1.6484 1.2958 1.0949 1.0455 1.0707 1.0574 1.0587 1.0525 1.1040 6.8966 7.4269 1.0749 1.0790 1.0558 1.0389 1.0382 1.0352 1.0981 1.0992 1.0949 1.0972 1.0979 1.0978 1.0965 1.1050 1.0882 1.0975 1.0650
irintensity: 0.0162 0.0545 2.0462 2.1179 1.3233 0.1354 1.1943 1.0825 4.7896 0.2215 2.0641 0.7156 2.1682 2.0511 56.9370 25.3066 29.2858 8.6149 0.7871 4.2332 0.8106 2.4103 10.3420 11.6294 5.1372 5.3964 8.4608 4.3482 4.0970 2.6309 43.7868 16.8108 40.8693 44.9556 3.4372 5.4448 1.0297 3.1290 2.5784 15.1250 11.2515 29.4065 5.7402 17.5603 5.0828 3.3316 54.6844 12.1703 87.3182 97.8925 161.6573 8.6926 2.9974 4.3911 2.8235 6.7668 1.8399 23.4589 4.5282 16.4352 54.9204 12.0377 106.9837 44.2510 7.1198 2.3188 2.9640 18.3672 9.7051 27.8056 14.6341 7.8629 5.8867 4.9614 52.7936 18.3251 52.3282 16.8807 88.1601 16.0914 9.6465 5.7566 63.4954 63.1461 58.7903 36.2361 16.7518 1.8251 3.9177 35.6739
temp: 298.150 k
press: 1.00000 atm
elementType: 35 8 8 6 6 6 6 6 6 6 6 6 6 6 6 1 1 1 1 1 1 1 1 1 1 1 1 1 1 1 1 1
symmnumber: 1
zpe: 687233.1 jmol-1
zpe.correction: 0.261753 hartree
zpe.thermalcorrener: 0.279048 hartree
zpe.thermalcorrenthalpy: 0.279993 hartree
zpe.thermalcorrgfe: 0.213655 hartree
zpe.sumelectzpe: -630.204628 hartree
zpe.sumelectthermal: -630.187333 hartree
zpe.sumelectthermalent: -630.186388 hartree
zpe.sumelectthermalfe: -630.252726 hartree
dipole: -0.9866 -2.0731 -1.5975
dipole: 2.7969
quadrupole: -96.2015 -97.2303 -102.4807
quadrupole: 3.6491 -3.8515 5.4666
quadrupole: 2.4360 1.4072 -3.8432 3.6491 -3.8515 5.4666
hfenergy: -630.4663811 hartree
pointgroup: C01 [X(C12H17Br1O2)]
dipole: 0.4937918 -0.8461061 0.501151 debye
polarizability: 190.3791313|17.2432722|177.291084|18.2456507|9.6268459|98.7358216 unknown
InChI: InChI=1S/C12H17BrO2/c1-8(2)4-5-9-10(13)6-7-11(15-3)12(9)14/h6-8,14H,4-5H2,1-3H3
charge 0 multiplicity 1
32 atoms
Br 0.776991 3.233591 0.592189
O  -0.820152 -1.897761 -0.123977
O  -3.409245 -1.037847 -0.996881
C  3.551681 -0.918871 -0.117196
C  2.184089 -0.308171 -0.522518
C  1.238991 -0.016231 0.68011
C  -0.140913 0.448975 0.243381
C  4.376551 0.039922 0.775392
C  4.354914 -1.308749 -1.381176
C  -1.119024 -0.519805 -0.133784
C  -0.513318 1.810908 0.130738
C  -2.423615 -0.140621 -0.55968
C  -1.785763 2.217953 -0.315768
C  -2.736835 1.232847 -0.6500
C  -3.707365 -2.219141 -0.158991
H  3.355321 -1.847132 0.46475
H  1.681714 -0.989308 -1.240571
H  2.357864 0.639495 -1.069667
H  1.697351 0.760022 1.314684
H  1.168185 -0.920009 1.326075
H  5.362449 -0.399047 1.01584
H  3.868948 0.262565 1.731368
H  4.551704 1.000256 0.252867
H  3.790962 -2.016291 -2.01769
H  4.581339 -0.412833 -1.990641
H  5.316317 -1.784004 -1.111896
H  -2.036495 3.278649 -0.392748
H  -3.737649 1.508542 -0.994214
H  0.122856 -2.044708 0.136661
H  -4.557556 -2.70711 -0.659257
H  -4.002032 -1.903535 0.860608
H  -2.841768 -2.897954 -0.10691
