program: Gaussian 09
title: 000283867
version: EM64L-G09RevD.01
frameworkgroup: C1[X(C7H5FO3S)]
method: RPBEPBE
basis: SDD
operation: Freq
keyword: #p
keyword: freq=noraman
keyword: PBEPBE/SDD
title: #p freq=noraman PBEPBE/SDD
converged: YES YES NO NO
title: Mulliken charges:
elementType: S F O O O C C C C C C C H H H H H
charge: 1.096648 -0.338659 -0.470944 -0.468044 -0.180307 -0.088019 -0.208039 -0.208568 0.401372 -0.343333 -0.326257 -0.183405 0.294503 0.293752 0.256864 0.291684 0.180753
chargesum: 0.00000
title: Mulliken charges with hydrogens summed into heavy atoms:
elementType: S F O O O C C C C C C C
charge: 1.096648 -0.338659 -0.470944 -0.468044 -0.180307 -0.088019 0.086464 0.085183 0.401372 -0.086469 -0.034574 -0.002652
polarizability: 1.66656485e+02 -2.31744061e+00 1.09844580e+02 4.54861537e+00 6.60783287e-01 5.57832789e+01
1716.lowfreq: -4.9739 0.0019 0.0022 0.0030 2.9774 7.6126 29.5939 62.8889 116.8552
frequency: 29.5173 62.8856 116.8542 122.4557 181.1725 194.0180 222.5930 243.2802 285.0429 340.2970 355.1320 407.1627 408.6408 487.2668 500.5714 561.4488 611.4366 661.2870 709.0044 808.3055 834.6810 852.7748 855.9424 966.3086 989.8657 994.0086 996.6807 1009.6507 1041.8490 1111.0978 1175.0169 1201.4790 1290.7890 1364.5479 1390.3754 1413.5245 1461.7368 1580.7791 1588.1701 1626.1118 2892.8244 3138.6455 3156.1841 3169.7478 3173.2728
redmass: 5.9222 10.2983 10.5163 7.7182 4.2310 8.9691 9.7402 8.6881 6.4135 6.0848 8.6343 5.8678 3.7403 4.1129 5.9030 14.3191 7.0630 6.8144 3.6793 5.0208 1.3336 1.2914 11.9233 1.3927 5.7152 2.7317 2.7040 1.6106 2.4313 1.3538 1.1724 2.9076 1.2662 1.7312 4.4238 2.3362 2.2509 7.8687 6.2224 7.3810 1.0862 1.0902 1.0888 1.0959 1.0980
irintensity: 1.2703 5.2290 7.5740 4.0987 5.2604 3.9407 8.4344 9.4966 8.3183 0.0383 8.7164 38.2417 19.4965 1.8932 34.1900 153.5965 2.3229 42.3659 0.1372 54.0004 62.7494 13.8917 64.7228 3.0648 1.2521 41.7431 35.7457 7.3917 23.1597 3.8999 5.1246 54.3426 3.4505 5.9638 34.3599 12.3108 0.2730 81.0267 5.1363 124.5132 106.0868 3.6756 4.0562 3.0517 1.1916
temp: 298.150 k
press: 1.00000 atm
elementType: 16 9 8 8 8 6 6 6 6 6 6 6 1 1 1 1 1
symmnumber: 1
zpe: 278636.8 jmol-1
zpe.correction: 0.106127 hartree
zpe.thermalcorrener: 0.117632 hartree
zpe.thermalcorrenthalpy: 0.118576 hartree
zpe.thermalcorrgfe: 0.067340 hartree
zpe.sumelectzpe: -992.264734 hartree
zpe.sumelectthermal: -992.253229 hartree
zpe.sumelectthermalent: -992.252284 hartree
zpe.sumelectthermalfe: -992.303521 hartree
dipole: 3.6604 2.1382 -0.5744
dipole: 4.2779
quadrupole: -101.4737 -70.6104 -80.9329
quadrupole: 8.1452 0.3453 0.1168
quadrupole: -17.1347 13.7286 3.4061 8.1452 0.3453 0.1168
hfenergy: -992.3708608 hartree
pointgroup: C01 [X(C7H5F1O3S1)]
dipole: -1.4372549 0.8478788 0.2193096 debye
dipolederiv: 2.0634052 -0.0395631 -0.0053004 -0.0577667 1.201671 0.0072431 -0.0328011 0.0087994 1.610617 -0.5598497 0.0139455 0.054792 0.0235712 -0.3190782 -0.0183278 0.2540508 -0.0279057 -0.8783089 -0.6793941 -0.0177666 -0.0258561 -0.0794393 -0.5256493 -0.0692932 -0.0525349 -0.0289851 -0.4230672 -0.662102 0.0277506 -0.0165034 0.0929992 -0.5270924 0.0777896 -0.0495827 0.0405808 -0.4272325 -0.981861 -0.104562 -0.0210972 -0.3948352 -0.5126263 -0.0115864 -0.0195108 -0.0019391 -0.3128378 -0.0077437 0.0008655 0.0011904 0.0182156 0.0346425 0.0019319 -0.1715033 0.0121265 -0.141282 -0.2136756 0.2408528 -0.0004347 -0.1372816 -0.0737178 -0.0092238 0.0332174 0.0147458 -0.0723653 -0.2316168 -0.2285076 0.0018851 0.1654967 -0.0507079 0.0100714 0.0278338 -0.0203907 -0.0737676 -0.6535073 0.0384048 -0.0225563 0.1711974 -0.0293996 0.0063024 -0.0269203 0.0016407 0.0387779 0.0260583 -0.2261825 0.0072888 0.1042828 0.0524682 0.0038193 0.0102048 -0.0098142 -0.1248732 -0.0079271 0.2149106 0.0030622 -0.1219607 0.0046269 -0.0054218 0.0094637 0.0080641 -0.0798113 1.619061 0.0384572 0.0498992 0.005479 0.7399345 -0.0046191 0.0546977 -0.003464 0.1237798 0.0999209 -0.0603222 -0.0065148 -0.0311502 0.095327 -0.0000662 -0.0054196 -0.0094952 0.1641945 0.1055438 0.0567775 -0.0062117 0.0283892 0.0842646 0.0009195 -0.0042193 0.0104704 0.1612102 0.0241891 0.0840492 -0.0056915 0.0495501 -0.0035088 0.0012132 -0.0117358 0.0030174 0.1626774 0.0667221 -0.0563138 -0.0036287 -0.0048034 0.054117 0.0012234 -0.0102397 -0.0001752 0.1606768 -0.0072233 0.0172041 -0.0043229 0.1680559 -0.2252714 0.0080245 -0.0050007 0.002724 0.1116123 unknown
polarizability: 166.6079076|1.9990989|109.8265148|5.3544583|-0.4352256|55.8499214 unknown
InChI: InChI=1S/C7H5FO3S/c8-12(10,11)7-3-1-6(5-9)2-4-7/h1-5H
charge 0 multiplicity 1
17 atoms
S  2.588963 -0.087903 0.162231
F  2.888124 -0.158766 -1.667098
O  3.224578 1.298627 0.666081
O  3.040554 -1.514921 0.743876
O  -4.303934 -0.653175 -0.086034
C  0.717178 0.034998 0.080155
C  0.155106 1.321559 0.056259
C  -0.017259 -1.165054 0.059526
C  -2.038316 0.221494 -0.01616
C  -1.252879 1.402753 0.009359
C  -1.420498 -1.058056 0.012562
C  -3.526491 0.333555 -0.067143
H  0.786795 2.214539 0.083426
H  0.48739 -2.135584 0.08867
H  -1.740026 2.384634 -0.009962
H  -2.056216 -1.949459 -0.005192
H  -3.92057 1.380158 -0.087957
