program: Gaussian 09
title: 000283894
version: EM64L-G09RevD.01
frameworkgroup: C1[X(C20H16O2S3)]
method: RPBEPBE
basis: SDD
operation: Freq
keyword: #p
keyword: freq=noraman
keyword: PBEPBE/SDD
title: #p freq=noraman PBEPBE/SDD
converged: YES YES NO NO
title: Mulliken charges:
elementType: S S S O O C C C C C C C C C C C C C C C C C C C C H H H H H H H H H H H H H H H H
charge: 0.341498 0.207807 0.208633 -0.274018 -0.274606 0.315156 0.314610 0.439532 0.439343 -0.330473 -0.330874 -0.350858 -0.350232 -0.402725 -0.400715 -0.381086 -0.382772 0.193794 0.195057 -0.804997 -0.804923 -0.166532 -0.167494 -0.518081 -0.517848 0.218593 0.218736 0.277194 0.277287 0.233813 0.233798 0.235699 0.235808 0.229843 0.228049 0.241121 0.228182 0.241134 0.229733 0.236740 0.237072
chargesum: 0.00000
title: Mulliken charges with hydrogens summed into heavy atoms:
elementType: S S S O O C C C C C C C C C C C C C C C C C C C C
charge: 0.341498 0.207807 0.208633 -0.274018 -0.274606 0.315156 0.314610 0.439532 0.439343 -0.111880 -0.112138 -0.073664 -0.072946 -0.168911 -0.166917 -0.145388 -0.146964 0.193794 0.195057 -0.105984 -0.105874 0.070208 0.069578 -0.518081 -0.517848
polarizability: 8.00417026e+02 -7.68812468e-02 2.73828944e+02 -1.37939152e+00 5.27712547e-01 1.08400604e+02
1716.lowfreq: -22.4662 -16.5586 -3.7210 -3.4612 -0.9384 -0.0011 0.0007 0.0022 15.1258
frequency: -22.4365 -16.4895 15.0965 19.9534 27.0740 32.8173 35.1646 68.8898 70.0380 90.7590 135.2436 143.5074 148.3662 151.9406 173.0643 173.5446 189.6086 241.4107 289.8477 293.8002 298.6897 334.4940 337.3869 347.1622 360.5190 370.5195 401.9541 402.0118 439.6600 451.9308 460.7153 463.9592 466.5251 507.3881 507.5021 566.6772 576.8015 634.5208 634.5708 635.2459 641.4189 677.3586 678.4666 726.5091 728.3534 767.1206 769.6491 807.1626 812.1359 813.4093 818.3752 833.5527 833.7066 862.6996 862.8121 909.5983 945.9077 962.4857 962.6373 986.7354 986.8873 998.6356 998.6909 1009.5342 1009.9950 1046.8360 1046.9360 1067.5762 1068.6863 1127.2906 1127.7025 1195.6213 1197.0442 1223.9506 1224.7914 1246.1053 1249.7659 1305.3156 1306.8479 1335.9600 1345.8027 1361.9627 1367.5927 1394.0674 1396.9145 1397.0685 1403.3058 1423.2491 1433.0374 1469.0900 1470.1067 1472.2135 1472.2704 1494.9746 1503.1712 1513.6939 1521.1086 1577.7354 1578.3262 1620.2593 1620.4985 2976.4671 2976.5070 3058.2948 3058.3753 3088.9036 3089.0499 3124.9119 3124.9914 3128.7148 3129.0897 3151.9644 3152.1678 3163.2261 3163.3800 3172.9510 3173.2487
redmass: 1.0143 1.0142 6.6964 3.8777 4.9704 6.3776 5.6681 5.8642 6.3227 5.9686 7.6041 4.7720 5.4472 8.9716 5.9573 9.7829 12.3538 6.7610 4.5734 4.7198 5.7358 4.7396 8.5889 5.0487 4.4804 18.8341 2.7880 2.7895 13.3835 6.0563 4.2082 5.6497 5.0587 3.5228 3.6197 6.9276 7.0049 6.8564 6.9261 6.7916 6.2546 3.0010 3.2176 2.3277 2.3683 6.1734 5.8665 1.5445 1.5273 6.6658 6.7854 1.6178 1.6150 1.3689 1.3705 7.1576 7.0101 1.3674 1.3667 1.4106 1.4099 1.3647 1.3638 3.0849 3.0533 1.5906 1.5910 3.0397 2.8926 1.3314 1.3339 1.1249 1.1241 3.0580 3.1878 1.6229 1.6751 1.5352 1.4321 2.7364 2.8971 4.6211 4.5127 7.4656 1.2312 1.2313 5.7824 3.7123 4.4161 1.1371 1.1516 1.0570 1.0573 3.9627 3.1459 3.1999 4.4655 6.0394 6.0737 6.2508 6.2638 1.0391 1.0391 1.0943 1.0943 1.1000 1.1000 1.0880 1.0880 1.0895 1.0895 1.0955 1.0955 1.0954 1.0954 1.0913 1.0914
irintensity: 0.5828 0.5651 0.0003 0.0131 0.9032 0.0536 0.5154 5.6117 15.0326 0.0020 0.0430 0.0033 0.1783 3.4942 0.6363 140.9902 0.0008 3.4628 7.5317 0.0030 0.4412 15.6057 0.0347 94.0443 0.6752 20.7066 0.0212 0.0822 0.4888 3.2099 1.3377 0.0690 0.0832 8.7624 37.7126 1.3164 161.3472 0.0579 0.5625 25.3526 0.9747 5.2042 0.0023 1.6112 0.0693 25.8691 4.8001 147.5647 0.0369 2.4506 5.0571 8.2733 20.3656 10.8173 2.5587 17.6202 12.4775 1.5391 1.7008 0.6776 0.8145 1.7691 2.3102 30.7319 0.7814 62.7610 2.8908 13.4194 0.3605 44.8342 14.6779 153.4837 4.1030 49.0806 3.5325 263.4271 29.8796 46.0563 2.0067 84.3499 0.2400 0.2772 13.0795 85.2826 13.0086 20.2651 0.5931 100.1749 35.9470 94.3815 31.9712 17.6262 10.9936 1137.6201 32.8633 463.2904 39.8158 34.8999 4.9031 161.2363 22.4062 61.2018 11.9768 24.0640 22.1169 15.4042 15.9004 16.5804 17.4054 37.3308 27.9933 12.4224 13.3222 7.8424 6.5806 2.9365 0.9669
temp: 298.150 k
press: 1.00000 atm
elementType: 16 16 16 8 8 6 6 6 6 6 6 6 6 6 6 6 6 6 6 6 6 6 6 6 6 1 1 1 1 1 1 1 1 1 1 1 1 1 1 1 1
symmnumber: 1
zpe: 784997.4 jmol-1
zpe.correction: 0.298990 hartree
zpe.thermalcorrener: 0.321841 hartree
zpe.thermalcorrenthalpy: 0.322785 hartree
zpe.thermalcorrgfe: 0.242891 hartree
zpe.sumelectzpe: -2114.603405 hartree
zpe.sumelectthermal: -2114.580554 hartree
zpe.sumelectthermalent: -2114.579609 hartree
zpe.sumelectthermalfe: -2114.659504 hartree
dipole: 0.0279 -6.0660 0.0062
dipole: 6.0661
quadrupole: -97.8879 -161.0653 -175.6244
quadrupole: 0.0116 -1.2765 0.1085
quadrupole: 46.9713 -16.2061 -30.7652 0.0116 -1.2765 0.1085
hfenergy: -2114.9023948 hartree
pointgroup: C01 [X(C20H16O2S3)]
dipole: -0.0772968 -0.2609655 2.3710097 debye
polarizability: 791.5751408|-77.086358|119.0524409|5.9731882|-18.5712268|272.0189929 unknown
InChI: InChI=1S/C20H16O2S3/c1-13-3-7-15(8-4-13)17(21)11-19(23)25-20(24)12-18(22)16-9-5-14(2)6-10-16/h3-12H,1-2H3
charge 0 multiplicity 1
41 atoms
S  -0.000096 -0.024693 0.130975
S  1.318221 0.14135 -2.721566
S  -1.166945 0.409636 -2.758983
O  3.737485 -0.155547 -2.453785
O  -3.594905 0.647939 -2.565684
C  5.224222 -0.532578 -0.587681
C  -5.185545 0.622162 -0.748513
C  7.877245 -0.943551 0.415931
C  -7.896005 0.803818 0.164748
C  5.453536 -0.7217 0.802195
C  -5.493648 0.519862 0.635328
C  6.340996 -0.549124 -1.467131
C  -6.25245 0.814283 -1.668091
C  6.759481 -0.922041 1.291169
C  -6.827598 0.608258 1.079411
C  7.642032 -0.74897 -0.971997
C  -7.58184 0.901178 -1.217737
C  3.867729 -0.315427 -1.167566
C  -3.796691 0.533895 -1.283564
C  9.277643 -1.192003 0.943152
C  -9.32697 0.929457 0.652016
C  2.679311 -0.274296 -0.342641
C  -2.654042 0.320681 -0.421684
C  1.451725 -0.068909 -0.95887
C  -1.393529 0.246813 -1.000452
H  4.621451 -0.711766 1.51373
H  -4.701263 0.368534 1.375636
H  6.15851 -0.399089 -2.536112
H  -6.009336 0.888214 -2.732953
H  6.917302 -1.063198 2.367068
H  -7.046496 0.523791 2.150558
H  8.490634 -0.754625 -1.66643
H  -8.391091 1.045176 -1.943468
H  10.0387 -0.678686 0.329833
H  9.386953 -0.848886 1.986742
H  9.518461 -2.273044 0.925787
H  -9.490313 0.362317 1.585015
H  -9.579499 1.987257 0.862356
H  -10.045939 0.566177 -0.102872
H  2.734237 -0.39994 0.740988
H  -2.768374 0.21638 0.659545
