program: Gaussian 09
title: 000283911
version: EM64L-G09RevD.01
frameworkgroup: C1[X(C21H28O2)]
method: RPBEPBE
basis: SDD
operation: Freq
keyword: #pfreq=noraman
keyword: PBEPBE/SDD
title: #p freq=noraman PBEPBE/SDD
converged: YES YES NO NO
title: Mulliken charges:
elementType: O O C C C C C C C C C C C C C C C C C C C C C H H H H H H H H H H H H H H H H H H H H H H H H H H H H
charge: -0.218548 -0.221684 0.179344 0.179344 0.333757 0.333758 -0.414230 -0.414230 0.072820 0.072819 0.296360 0.296361 -0.520692 -0.520692 -0.470304 -0.470305 -0.234101 -0.819967 -0.819967 -0.755431 -0.799002 -0.799002 -0.755431 0.281152 0.281152 0.230690 0.231017 0.231017 0.230690 0.233539 0.239670 0.239669 0.233540 0.226328 0.220798 0.226309 0.226329 0.226309 0.220798 0.208330 0.218091 0.241354 0.216916 0.235530 0.224788 0.216916 0.224788 0.235530 0.208330 0.241354 0.218092
chargesum: 0.00000
title: Mulliken charges with hydrogens summed into heavy atoms:
elementType: O O C C C C C C C C C C C C C C C C C C C C C
charge: -0.218548 -0.221684 0.179344 0.179344 0.333757 0.333758 -0.133078 -0.133078 0.072820 0.072819 0.296360 0.296361 -0.058985 -0.058985 0.002905 0.002905 -0.234101 -0.146531 -0.146532 -0.087656 -0.121768 -0.121768 -0.087656
polarizability: 2.69294435e+02 -7.52179922e-06 2.12726971e+02 1.63653657e-05 -2.54872335e+00 1.81028624e+02
1716.lowfreq: -13.6821 -13.2608 -0.0006 -0.0004 -0.0003 5.5108 28.3893 62.3533 98.3713
frequency: 28.0763 62.3173 98.3690 100.2558 124.3962 132.4768 133.1848 170.2735 174.3164 182.5687 195.6354 201.6716 205.0100 223.5951 224.8536 237.8423 239.3295 242.5593 272.1732 294.2193 299.5811 308.2133 322.8243 353.7750 383.1140 386.1409 395.8780 449.4691 452.2918 474.9930 502.1330 518.9857 538.1245 557.2889 567.2659 574.0322 590.7810 628.1635 657.2601 674.6799 677.9783 678.3448 738.2756 740.8925 773.1219 807.4224 831.8285 840.5970 842.2857 854.1578 870.0083 882.9115 884.4017 897.8652 931.9310 933.1619 940.3356 940.3929 960.9892 967.9251 971.5590 973.6701 995.1476 995.6737 1012.6583 1015.5503 1077.2158 1078.4401 1103.5944 1108.6628 1118.3524 1129.3235 1135.4203 1135.9117 1157.2816 1159.7640 1173.4305 1177.5973 1194.7743 1198.9135 1203.7016 1208.2353 1218.9189 1220.0174 1224.5923 1238.7948 1265.5005 1267.3323 1281.1314 1282.6937 1315.8383 1320.9819 1361.3050 1378.5850 1379.6158 1390.0161 1393.8494 1395.8575 1401.8979 1401.9495 1458.1234 1458.5009 1460.1942 1460.9312 1471.7365 1472.3118 1475.2943 1476.8253 1479.9219 1482.1730 1482.8613 1483.6375 1492.4445 1493.4520 1494.9831 1495.5910 1537.5689 1547.4166 1616.7105 2977.6249 2977.7154 2981.3583 2981.4687 2983.3305 2983.7592 3006.5650 3006.7646 3022.2073 3022.5930 3058.7643 3058.7928 3061.9544 3062.1086 3064.7283 3064.9140 3073.7675 3074.0020 3077.1679 3077.5239 3084.7144 3084.9935 3088.5995 3088.7816 3091.3866 3091.6945 3097.3033 3097.3294
redmass: 3.7412 3.2394 7.8343 3.8121 2.8433 1.0427 1.0957 1.2266 1.0590 1.9346 2.2579 3.5175 2.7591 1.1851 1.1603 2.3474 2.2927 4.2359 3.9850 3.1186 2.6950 1.7691 2.3826 3.0452 2.5572 3.1384 2.8077 2.9980 3.4458 3.4274 3.4951 4.1061 4.3528 5.3833 4.4346 3.5782 5.6286 6.0505 4.6818 2.7229 4.2430 5.4148 3.5760 3.8396 2.4445 5.4786 1.4637 1.7966 2.4615 2.3083 3.3709 2.9008 2.3549 2.4430 1.8503 1.8488 1.4168 1.4205 2.1512 2.9931 2.8622 2.0517 1.5174 1.4915 1.6089 1.8785 1.3394 1.2871 1.7785 1.5283 1.9001 2.4858 2.1925 2.1736 1.9569 2.5483 1.8459 1.7179 2.3640 2.5103 1.2236 1.3591 2.8153 2.9334 1.9960 1.6314 1.9757 2.1611 1.7922 1.6291 2.8901 3.3858 5.7395 1.2177 1.2119 2.2762 1.2269 1.7922 1.3284 1.2104 1.0612 1.0611 1.0559 1.0557 1.0500 1.0500 1.0557 1.0570 1.0572 1.0611 1.0721 1.0726 1.0776 1.0848 1.0583 1.0598 11.0038 8.9876 10.5791 1.0371 1.0371 1.0370 1.0370 1.0367 1.0367 1.0590 1.0590 1.0630 1.0629 1.0989 1.0989 1.1041 1.1041 1.0981 1.0980 1.0985 1.0985 1.0992 1.0991 1.1033 1.1032 1.0979 1.0977 1.0909 1.0914 1.0969 1.0969
irintensity: 0.9367 0.0005 3.3979 0.0205 0.8719 0.0383 0.1052 0.0123 0.0768 0.7055 0.0323 0.4166 0.3771 0.0010 0.1448 1.8711 0.1552 0.4921 5.3174 0.1581 0.5236 0.0108 0.5753 1.2934 0.0490 0.0357 1.6298 0.6405 0.2158 0.5183 0.0007 0.3812 1.3118 2.1290 3.3140 4.7076 1.1687 3.2092 6.8947 2.0267 1.0029 0.1244 1.5833 7.1316 15.0458 2.3431 1.7857 4.6115 1.8949 5.5969 2.7738 0.1485 6.3321 14.1986 0.4642 2.9234 1.4950 1.9454 0.0253 0.1322 1.8701 7.9284 5.2833 0.8493 17.7228 1.0138 9.0821 2.7443 6.9663 14.8905 6.8258 68.8421 69.8497 5.8913 1.5016 3.0217 0.9574 2.2031 12.0608 6.6309 2.8116 6.2622 0.8030 3.7709 0.0333 1.7232 7.2996 20.5411 7.7312 0.1637 3.5404 0.2918 2.5622 4.0298 22.8113 99.8321 25.2081 10.8307 57.8844 31.7015 1.4685 14.6984 12.1940 4.4143 6.3949 4.6089 5.9480 13.0018 13.1349 9.4856 1.5311 5.7897 4.8308 27.6326 0.2503 7.5060 111.6369 27.6515 226.8102 10.7177 27.7269 21.7499 30.8223 43.7903 62.2064 1.6716 60.3456 45.5813 56.2946 1.2199 3.3018 6.1428 1.4044 0.1626 89.6298 16.3996 19.9462 25.9293 19.4796 30.0022 25.7342 106.7296 6.8371 48.4565 20.1470 2.4305 49.4543
temp: 298.150 k
press: 1.00000 atm
elementType: 8 8 6 6 6 6 6 6 6 6 6 6 6 6 6 6 6 6 6 6 6 6 6 1 1 1 1 1 1 1 1 1 1 1 1 1 1 1 1 1 1 1 1 1 1 1 1 1 1 1 1
symmnumber: 1
zpe: 1147932.3 jmol-1
zpe.correction: 0.437224 hartree
zpe.thermalcorrener: 0.459439 hartree
zpe.thermalcorrenthalpy: 0.460383 hartree
zpe.thermalcorrgfe: 0.388883 hartree
zpe.sumelectzpe: -965.720295 hartree
zpe.sumelectthermal: -965.698080 hartree
zpe.sumelectthermalent: -965.697135 hartree
zpe.sumelectthermalfe: -965.768635 hartree
dipole: 0.0000 4.2565 -0.9062
dipole: 4.3519
quadrupole: -120.5040 -154.0147 -136.8018
quadrupole: 0.0000 0.0000 1.6573
quadrupole: 16.6028 -16.9079 0.3051 0.0000 0.0000 1.6573
hfenergy: -966.1575188 hartree
pointgroup: C01 [X(C21H28O2)]
dipole: 0.0000076 -1.681677 0.3216785 debye
polarizability: 269.2944351|0.0002945|212.819143|0.0004044|-1.8883285|180.9364514 unknown
InChI: InChI=1S/C21H28O2/c1-18(2)11-7-9-20(18,5)16-13(11)15(22)14-12-8-10-21(6,17(14)23-16)19(12,3)4/h11-12H,7-10H2,1-6H3
charge 0 multiplicity 1
51 atoms
O  0.000003 -1.244006 0.185817
O  -0.000015 2.995522 -0.312228
C  -2.567278 -1.041587 0.244807
C  2.567282 -1.041562 0.24483
C  -3.349229 -0.043465 -0.735674
C  3.349234 -0.043432 -0.735642
C  -2.68381 1.242064 -0.093026
C  2.683795 1.24209 -0.093002
C  -1.16532 -0.486732 0.054303
C  1.16532 -0.48672 0.054313
C  -1.204037 0.878179 -0.141835
C  1.204026 0.87819 -0.141825
C  -2.99237 -0.457777 1.660237
C  2.992353 -0.457747 1.660266
C  -3.087674 1.090249 1.424514
C  3.087645 1.09028 1.424543
C  -0.000009 1.718308 -0.213751
C  -2.758521 -2.546438 0.072117
C  2.758541 -2.546411 0.072143
C  -3.004581 -0.238202 -2.231228
C  -4.887329 -0.100365 -0.596915
C  4.887333 -0.100317 -0.596866
C  3.004605 -0.238173 -2.2312
H  -2.939532 2.212693 -0.542808
H  2.939512 2.212721 -0.542782
H  -2.25317 -0.728191 2.434397
H  -3.961748 -0.891746 1.964257
H  3.961732 -0.891706 1.964296
H  2.253147 -0.728168 2.434418
H  -4.110558 1.467639 1.598975
H  -2.405585 1.664314 2.073311
H  2.405542 1.664338 2.073332
H  4.110522 1.46768 1.599014
H  -2.466863 -2.879438 -0.940287
H  -3.815287 -2.825366 0.235724
H  -2.144748 -3.111787 0.796686
H  2.466896 -2.879414 -0.940263
H  2.144767 -3.111765 0.796707
H  3.815308 -2.825329 0.235759
H  -3.384333 -1.210899 -2.596831
H  -3.485519 0.552982 -2.835957
H  -1.920199 -0.196599 -2.427041
H  -5.278679 -1.046916 -1.014743
H  -5.245248 -0.019119 0.441867
H  -5.344326 0.72587 -1.173381
H  5.278698 -1.046863 -1.014692
H  5.344328 0.725924 -1.173325
H  5.24524 -0.01907 0.44192
H  3.38437 -1.210867 -2.596798
H  1.920225 -0.196581 -2.427025
H  3.485542 0.553015 -2.835924
