program: Gaussian 09
title: 000283870
version: EM64L-G09RevD.01
frameworkgroup: C1[X(C13H12NPS2)]
method: RPBEPBE
basis: SDD
operation: Freq
keyword: #p
keyword: freq=noraman
keyword: PBEPBE/SDD
title: #p freq=noraman PBEPBE/SDD
converged: YES YES NO NO
title: Mulliken charges:
elementType: S S P N C C C C C C C C C C C C C H H H H H H H H H H H H
charge: 0.088216 -0.174823 0.182303 -0.518918 0.665221 -0.359233 0.090888 -0.620328 -0.336461 -0.253100 -0.262286 -0.319023 -0.230763 -0.249160 -0.220083 -0.210988 -0.221737 0.240225 0.246329 0.250388 0.242894 0.241869 0.275691 0.283045 0.226560 0.231176 0.237570 0.238064 0.236465
chargesum: 0.00000
title: Mulliken charges with hydrogens summed into heavy atoms:
elementType: S S P N C C C C C C C C C C C C C
charge: 0.088216 -0.174823 0.182303 -0.518918 0.665221 -0.359233 0.090888 0.116614 -0.093567 -0.011231 0.013405 -0.035978 -0.004203 -0.017984 0.017487 0.027076 0.014728
polarizability: 2.91879428e+02 -2.68306749e+01 1.90910534e+02 -2.70315434e+00 2.83760595e+00 1.51883564e+02
1716.lowfreq: -7.6944 0.0007 0.0020 0.0026 2.9314 8.1081 28.8488 38.9302 55.5163
frequency: 28.7954 38.8521 55.5012 96.1996 112.1426 116.7247 145.1449 182.2275 200.4804 208.9402 230.0792 278.3268 291.9358 328.9335 350.3985 388.7319 397.6817 426.0269 439.3377 463.2683 486.2184 530.8823 544.5159 579.6399 610.3297 652.8594 689.5937 696.3243 700.5952 724.6778 749.9703 767.3761 837.7485 844.2714 858.3793 925.3707 942.0459 969.1465 984.6470 987.6558 1006.4128 1017.5198 1018.5026 1033.4791 1076.7114 1080.5831 1089.8681 1105.5354 1126.6047 1171.4153 1174.6872 1184.5538 1187.6132 1271.3440 1305.7309 1308.1563 1382.4375 1384.1421 1426.6906 1426.9949 1440.9833 1461.1808 1464.0308 1469.3510 1485.6476 1573.5576 1587.6340 1590.2861 1593.4573 2968.8617 3055.7094 3099.9480 3128.7536 3134.5502 3135.0672 3145.5273 3145.9963 3157.5135 3161.1100 3169.7636 3173.0833
redmass: 5.6148 3.8413 4.9526 4.4090 8.8923 3.9266 6.1362 1.3084 5.2985 5.7004 4.9208 3.5189 6.0256 5.5490 8.6023 6.5946 2.8304 9.9579 3.4251 9.9179 3.9265 5.2639 4.1654 12.8938 6.5762 7.1310 6.7078 2.3043 4.5362 2.5945 1.4736 1.6003 3.9776 1.4252 1.2458 1.3760 1.3760 1.3151 5.6279 1.4235 1.3295 5.3294 3.5582 2.4578 2.5243 1.6424 3.5457 1.3145 1.5161 1.1061 1.0546 1.5459 1.1437 1.6198 1.6320 2.0013 8.2563 9.3744 2.0535 2.1204 1.2987 1.9370 1.3048 1.7434 1.0788 6.4417 6.1665 5.8713 6.7470 1.0361 1.1004 1.0989 1.0869 1.0851 1.0879 1.0902 1.0914 1.0961 1.0939 1.1015 1.1002
irintensity: 0.3603 0.0337 1.2521 0.9734 0.9484 0.3848 2.8729 1.0691 4.1319 8.1710 0.8173 1.0720 0.1440 7.6725 1.5502 7.6971 0.0564 35.1029 4.9375 34.0419 22.8637 9.7816 7.8268 78.2009 2.9578 16.4517 10.8677 32.0426 55.1601 11.7271 90.6032 48.6300 89.2584 1.1821 0.8040 2.0736 1.2769 0.0488 1.6514 0.5470 0.2135 4.5265 6.0347 27.0745 52.3761 5.0696 42.7253 5.3163 13.1439 0.3664 0.0084 13.2362 9.1607 2.0590 54.2897 45.0706 14.0463 0.2516 6.3286 25.8847 12.2883 3.9716 76.9221 84.5898 50.0387 0.5820 0.1000 0.1215 32.8738 42.8649 19.0979 8.1874 1.1571 1.2756 0.8103 7.8254 4.3079 19.8085 20.4791 31.8987 21.2198
temp: 298.150 k
press: 1.00000 atm
elementType: 16 16 15 7 6 6 6 6 6 6 6 6 6 6 6 6 6 1 1 1 1 1 1 1 1 1 1 1 1
symmnumber: 1
zpe: 566928.1 jmol-1
zpe.correction: 0.215931 hartree
zpe.thermalcorrener: 0.231985 hartree
zpe.thermalcorrenthalpy: 0.232930 hartree
zpe.thermalcorrgfe: 0.171141 hartree
zpe.sumelectzpe: -1693.499047 hartree
zpe.sumelectthermal: -1693.482993 hartree
zpe.sumelectthermalent: -1693.482049 hartree
zpe.sumelectthermalfe: -1693.543837 hartree
dipole: -1.1266 -3.7301 2.6358
dipole: 4.7043
quadrupole: -102.7121 -128.8637 -117.7899
quadrupole: 2.2798 0.5713 1.6151
quadrupole: 13.7432 -12.4084 -1.3347 2.2798 0.5713 1.6151
hfenergy: -1693.7149787 hartree
pointgroup: C01 [X(C13H12N1P1S2)]
dipole: 0.5230948 -1.0815463 -1.4078625 debye
polarizability: 288.1004927|32.5987866|192.9907167|5.6123738|8.8413827|153.5823168 unknown
InChI: InChI=1S/C13H12NPS2/c1-14(12-9-5-6-10-13(12)16)15(17)11-7-3-2-4-8-11/h2-10H,1H3
charge 0 multiplicity 1
29 atoms
S  -0.704687 -0.453467 2.063533
S  0.761015 2.986232 1.179104
P  0.460401 0.993531 0.669603
N  -0.651972 0.639998 -0.684024
C  -1.915536 0.073226 -0.397193
C  -2.115938 -0.501303 0.894135
C  2.024135 0.087638 0.234141
C  -0.42766 1.350663 -1.955986
C  -2.98683 0.050024 -1.328422
C  -3.348975 -1.080677 1.247977
C  1.948017 -1.215393 -0.312599
C  3.271578 0.710376 0.462763
C  -4.214625 -0.553648 -0.977571
C  -4.402283 -1.117837 0.303587
C  3.140081 -1.895383 -0.642981
C  4.45985 0.019854 0.133649
C  4.395322 -1.280116 -0.418814
H  -0.602467 0.662433 -2.802703
H  0.617311 1.697272 -2.007227
H  -1.091407 2.231276 -2.058888
H  -2.864019 0.497224 -2.318945
H  -3.488641 -1.50208 2.248875
H  0.972654 -1.685984 -0.475434
H  3.299766 1.721748 0.885452
H  -5.030392 -0.570341 -1.70846
H  -5.358919 -1.575397 0.574714
H  3.090591 -2.903387 -1.068608
H  5.430566 0.495876 0.308386
H  5.318063 -1.813553 -0.672865
