program: Gaussian 09
title: 000283878
version: EM64L-G09RevD.01
frameworkgroup: C1[X(C14H24N2)]
method: RPBEPBE
basis: SDD
operation: Freq
keyword: #pfreq=noraman
keyword: PBEPBE/SDD
title: #p freq=noraman PBEPBE/SDD
converged: YES YES NO NO
title: Mulliken charges:
elementType: N N C C C C C C C C C C C C C C H H H H H H H H H H H H H H H H H H H H H H H H
charge: -0.047086 -0.055156 0.277908 0.285668 -0.500384 -0.495094 -0.724799 -0.716711 -0.717853 -0.743352 -0.305870 -0.278538 -0.015226 -0.017981 -0.600746 -0.596585 0.212012 0.202420 0.209501 0.202379 0.242233 0.194093 0.221563 0.217753 0.210322 0.229986 0.213279 0.216651 0.230212 0.233783 0.198164 0.226412 0.238734 0.237145 0.232837 0.222853 0.215049 0.214178 0.214793 0.215454
chargesum: 0.00000
title: Mulliken charges with hydrogens summed into heavy atoms:
elementType: N N C C C C C C C C C C C C C C
charge: -0.047086 -0.055156 0.277908 0.285668 -0.085951 -0.083214 -0.066910 -0.058651 -0.057711 -0.084992 -0.067136 -0.041393 0.217611 0.204872 -0.171519 -0.166339
polarizability: 2.20526304e+02 -1.14143139e+01 1.70185548e+02 5.03153376e+00 9.93243836e+00 1.34424774e+02
1716.lowfreq: -7.7366 -1.1578 -0.0007 -0.0007 -0.0006 9.2804 12.8779 29.2014 41.4936
frequency: 10.4250 29.1151 41.4837 61.2358 70.8819 79.7867 83.8972 95.4698 119.2957 172.9539 183.0190 198.6465 201.0571 209.6517 234.5390 243.0411 246.1123 255.6335 312.0314 326.2785 336.5347 339.1555 370.9769 378.3050 398.4376 413.7675 482.8929 493.8362 523.6866 528.2205 579.0336 629.8703 662.1156 783.5369 793.6790 877.3749 883.2618 889.0454 894.9035 902.4271 935.2796 937.5486 941.9501 944.4423 948.1858 949.0466 959.0636 963.9934 991.6848 994.6504 1006.0329 1007.2425 1008.9448 1017.8642 1084.8932 1095.7129 1153.0537 1159.1042 1185.5326 1192.9869 1200.2556 1208.1893 1281.2426 1282.4436 1296.4410 1298.1499 1302.0685 1310.3451 1320.2189 1344.5590 1374.8863 1375.8493 1396.4567 1397.5863 1426.0511 1426.2205 1450.0105 1451.0756 1460.7244 1461.0385 1465.4042 1465.8488 1474.9425 1476.8970 1483.4376 1489.1436 1568.2831 1620.5681 1658.3388 1659.3443 2948.5428 2956.1767 2971.3831 2972.4948 2986.9657 2987.2669 2991.5828 3001.9400 3021.3066 3026.3118 3067.2009 3068.1004 3078.8523 3080.1706 3080.4659 3082.8610 3084.6116 3085.1120 3092.0176 3096.8681 3101.3447 3101.8177 3191.8761 3193.7430
redmass: 3.7269 3.9290 3.8803 2.1892 2.5037 2.5864 3.1683 3.3676 3.1583 2.3326 2.3361 1.4743 1.4613 1.1948 2.0576 1.1729 1.1934 2.3733 2.7865 2.3946 2.8399 2.5514 3.2528 2.5039 2.0735 2.2874 2.2677 2.1855 3.6013 2.7128 2.8453 1.6774 2.0672 3.0909 2.9156 1.5823 1.6323 2.3196 2.7668 2.9579 1.5633 1.5318 1.3355 1.3470 1.3897 1.7349 1.7063 1.8204 1.5672 1.4580 1.1338 1.3414 1.2514 1.4086 1.6294 1.5566 2.5874 2.3253 2.3443 2.5637 1.7491 1.9605 1.3130 1.3083 1.3954 1.4932 1.5821 1.9150 1.3705 1.6148 1.1935 1.2098 1.2088 1.2134 1.1758 1.1699 1.0925 1.0962 1.0484 1.0626 1.0584 1.0494 1.0538 1.0542 1.0733 1.0761 8.2220 8.0567 4.6921 4.7210 1.0630 1.0601 1.0352 1.0349 1.0438 1.0381 1.0784 1.0873 1.0992 1.0962 1.0994 1.0994 1.0663 1.1000 1.0997 1.0642 1.0971 1.0966 1.0881 1.0947 1.0994 1.0956 1.1142 1.1143
irintensity: 0.2084 0.1925 0.0308 0.1181 0.3423 0.2277 0.5586 1.9355 6.8635 0.0375 0.1802 0.0826 0.0908 0.0068 0.0245 0.1477 0.0285 0.0455 2.4629 0.2363 1.4520 0.9268 1.0229 1.3954 2.7542 0.9866 7.7921 0.9631 1.4820 1.4180 3.1742 10.9263 2.9886 2.6136 3.2427 3.6031 15.9353 10.8704 13.4636 12.9554 6.5396 10.8769 74.5709 72.5965 16.9256 33.3313 4.4545 1.3805 5.7813 0.4561 13.4658 15.2594 9.3800 0.6926 1.0772 6.5115 3.6718 4.2434 17.2009 12.4156 2.0824 1.9703 0.5544 2.0708 5.9417 7.0467 19.4546 0.3715 3.2236 0.7627 20.1902 10.8239 30.2633 5.9754 5.4029 7.6398 5.3889 4.1733 0.4485 7.8968 8.8241 3.1715 11.4032 11.6674 21.2272 13.3426 0.0129 119.2413 12.6744 13.5816 28.9017 34.0687 34.0875 36.3142 57.5272 19.8444 31.1345 10.2509 23.6098 21.8524 34.3349 34.5575 15.5101 8.7368 7.5960 25.1775 99.7538 27.1883 7.9605 10.0684 22.6178 33.1768 24.5813 27.2703
temp: 298.150 k
press: 1.00000 atm
elementType: 7 7 6 6 6 6 6 6 6 6 6 6 6 6 6 6 1 1 1 1 1 1 1 1 1 1 1 1 1 1 1 1 1 1 1 1 1 1 1 1
symmnumber: 1
zpe: 906218.3 jmol-1
zpe.correction: 0.345160 hartree
zpe.thermalcorrener: 0.365592 hartree
zpe.thermalcorrenthalpy: 0.366537 hartree
zpe.thermalcorrgfe: 0.294301 hartree
zpe.sumelectzpe: -656.025633 hartree
zpe.sumelectthermal: -656.005200 hartree
zpe.sumelectthermalent: -656.004256 hartree
zpe.sumelectthermalfe: -656.076492 hartree
dipole: 0.3071 -0.6494 -0.1198
dipole: 0.7282
quadrupole: -88.5377 -99.5609 -100.4413
quadrupole: 0.1423 1.8391 0.3043
quadrupole: 7.6423 -3.3809 -4.2614 0.1423 1.8391 0.3043
hfenergy: -656.3707929 hartree
pointgroup: C01 [X(C14H24N2)]
dipole: -0.1240908 0.2538019 -0.047645 debye
polarizability: 219.5930027|-12.2508789|169.5003231|-10.0281579|-10.3194458|136.0433 unknown
InChI: InChI=1S/C14H24N2/c1-7-9-13(3,4)11-15-16-12-14(5,6)10-8-2/h7-8,11-12H,1-2,9-10H2,3-6H3
charge 0 multiplicity 1
40 atoms
N  0.555107 0.741215 0.356314
N  -0.7421 0.799282 -0.324637
C  2.998313 0.855559 -0.079689
C  -3.18217 0.677479 0.10633
C  3.736149 -0.24976 -0.923928
C  -3.881151 -0.618708 0.665095
C  3.17898 0.60346 1.433395
C  3.599508 2.240514 -0.469859
C  -3.840278 1.908759 0.802682
C  -3.35037 0.7925 -1.42676
C  1.537553 0.867921 -0.496765
C  -1.723227 0.646249 0.525329
C  3.235697 -1.659281 -0.689289
C  -3.352187 -1.924345 0.109998
C  4.017177 -2.720397 -0.368132
C  -2.826279 -2.927804 0.856103
H  4.819271 -0.190754 -0.700913
H  3.614838 0.006661 -1.999053
H  -4.961745 -0.524182 0.426466
H  -3.795264 -0.626343 1.770062
H  2.770478 -0.378453 1.724596
H  4.254304 0.62672 1.692323
H  2.653163 1.372932 2.024317
H  4.682806 2.258039 -0.247643
H  3.467936 2.45228 -1.548039
H  3.116559 3.052503 0.102448
H  -3.720826 1.866055 1.90171
H  -4.923026 1.935456 0.577448
H  -3.388111 2.850292 0.443463
H  -2.8174 -0.015412 -1.954779
H  -4.423106 0.751453 -1.694826
H  -2.931087 1.745324 -1.792844
H  1.330302 0.998844 -1.578091
H  -1.51775 0.495163 1.603345
H  2.151033 -1.810769 -0.804103
H  -3.419463 -2.053913 -0.980347
H  3.596481 -3.722674 -0.227923
H  5.101875 -2.617003 -0.235396
H  -2.46596 -3.8565 0.39929
H  -2.737132 -2.848061 1.947107
