program: Gaussian 09
title: 000283955
version: EM64L-G09RevD.01
frameworkgroup: C1[X(C17H10O4)]
method: RPBEPBE
basis: SDD
operation: Freq
keyword: #pfreq=noraman
keyword: PBEPBE/SDD
title: #p freq=noraman PBEPBE/SDD
converged: YES YES NO NO
title: Mulliken charges:
elementType: O O O O C C C C C C C C C C C C C C C C C H H H H H H H H H H
charge: -0.259391 -0.287848 -0.152871 -0.190159 -0.181007 -0.109197 0.479973 0.468789 0.316339 0.179944 -0.075173 -0.384729 0.062623 -0.380239 -0.432884 -0.401820 -0.219150 -0.231947 -0.229520 0.237529 -0.744807 0.252404 0.270923 0.282870 0.264753 0.233877 0.237234 0.232984 0.255134 0.252179 0.253190
chargesum: 0.00000
title: Mulliken charges with hydrogens summed into heavy atoms:
elementType: O O O O C C C C C C C C C C C C C C C C C
charge: -0.259391 -0.287848 -0.152871 -0.190159 -0.181007 -0.109197 0.479973 0.468789 0.316339 0.179944 -0.075173 -0.132325 0.062623 -0.109317 -0.150014 -0.137068 0.014726 0.005287 0.003464 0.237529 0.015696
polarizability: 2.82963404e+02 2.76992814e+01 2.83784486e+02 -1.01598065e+01 5.80195809e+00 8.83760533e+01
1716.lowfreq: -4.3499 -0.5157 -0.0006 0.0004 0.0006 3.8842 27.8977 38.7939 57.2421
frequency: 27.8409 38.7763 57.2369 74.4770 84.4861 108.4979 154.3584 190.2839 206.3367 227.6071 238.0835 270.4136 282.8041 313.5581 392.0865 395.4765 403.7989 413.0685 482.8131 493.8443 498.1419 539.3645 551.7266 568.2857 595.8673 619.4475 630.0251 633.0194 657.0331 669.8651 699.3134 730.5711 736.7467 769.8341 784.9712 797.2218 828.1119 841.1604 847.0697 896.5193 934.1453 947.1934 957.0650 976.7307 983.8321 990.3681 999.5617 1020.0091 1035.0481 1038.6413 1062.7740 1078.6116 1146.1770 1164.3604 1172.8811 1186.1519 1222.2941 1266.1570 1308.4153 1332.4401 1362.5832 1371.2062 1384.1097 1411.0834 1431.6576 1451.8931 1452.2693 1457.2695 1467.6034 1483.1643 1538.5296 1579.8732 1612.5187 1628.6891 1644.6733 1683.6086 1724.4921 3009.0296 3096.8539 3136.5644 3145.0828 3145.2958 3150.8672 3163.3959 3165.6024 3174.6394 3175.3123
redmass: 2.5321 2.4242 5.0279 1.9658 5.7154 5.3933 5.8589 6.0303 5.1056 7.3946 5.2455 5.3481 6.9035 5.4920 7.5903 6.8634 6.2356 3.9125 3.8196 5.0187 3.8568 5.3501 4.2851 6.3629 4.5793 4.7642 7.0062 7.9838 7.3714 6.2652 5.3678 8.5827 3.1504 2.8948 2.0540 1.8534 5.2307 2.5219 7.7932 2.1454 1.4636 7.5922 6.7089 1.3745 2.0952 1.3773 1.3393 2.2443 2.2657 1.7450 3.5063 5.4413 2.2093 2.2133 1.2006 1.2233 1.8400 1.6570 2.6807 5.6548 4.0425 1.9828 1.2407 4.6529 3.1429 1.0549 1.0515 3.2886 5.9520 3.4382 7.2275 7.4831 7.6531 7.8075 8.8777 10.3534 12.9813 1.0371 1.0968 1.0859 1.0870 1.1013 1.0893 1.0927 1.0958 1.0994 1.0988
irintensity: 2.9091 0.1520 0.5425 0.7854 3.0911 2.9851 1.0246 1.8494 0.1718 0.0294 0.0293 2.0080 0.9556 5.0716 0.3043 0.1614 0.8007 5.0167 0.3316 10.6794 1.8976 10.5771 4.9497 10.8866 6.0254 13.9340 5.9269 3.7202 10.5945 40.1570 8.4758 67.6763 12.3508 89.6886 42.2654 19.5528 55.5863 13.3475 91.3196 0.2188 1.8582 6.1770 56.4959 4.7169 114.3619 0.3293 0.1141 8.4541 15.2428 7.0747 68.7937 91.8059 308.4123 134.5973 20.6404 13.1355 11.9487 7.1831 3.8305 71.3191 117.8185 3.3834 48.1668 31.9640 16.3429 24.6153 22.1707 21.5674 49.0350 12.8985 0.9757 11.7052 7.0384 9.1980 7.0975 158.2740 603.1168 1.0405 4.7968 5.6388 3.4260 8.8055 5.9501 3.5974 8.9463 42.0281 4.0648
temp: 298.150 k
press: 1.00000 atm
elementType: 8 8 8 8 6 6 6 6 6 6 6 6 6 6 6 6 6 6 6 6 6 1 1 1 1 1 1 1 1 1 1
symmnumber: 1
zpe: 583902.5 jmol-1
zpe.correction: 0.222397 hartree
zpe.thermalcorrener: 0.238969 hartree
zpe.thermalcorrenthalpy: 0.239913 hartree
zpe.thermalcorrgfe: 0.176977 hartree
zpe.sumelectzpe: -953.305358 hartree
zpe.sumelectthermal: -953.288786 hartree
zpe.sumelectthermalent: -953.287842 hartree
zpe.sumelectthermalfe: -953.350778 hartree
dipole: 5.6855 -1.3161 -2.0124
dipole: 6.1731
quadrupole: -123.1621 -97.6240 -127.4555
quadrupole: 6.1505 -2.2319 5.6357
quadrupole: -7.0816 18.4566 -11.3750 6.1505 -2.2319 5.6357
hfenergy: -953.5277547 hartree
pointgroup: C01[X(C17H10O4)]
dipole: 2.0790791 -1.0029091 -0.7550353 debye
polarizability: 294.4190253|25.1056222|272.6751013|-9.254094|1.6024329|88.0298171 unknown
InChI: InChI=1S/C17H10O4/c1-9(18)20-15-10-5-2-3-6-11(10)16-14-12(15)7-4-8-13(14)17(19)21-16/h2-8H,1H3
charge 0 multiplicity 1
31 atoms
O  -2.46446 1.724653 0.141141
O  2.29318 -1.263185 -0.501483
O  -4.656889 0.811141 0.249005
O  2.168843 -2.379986 1.566979
C  -1.273927 -0.245239 -0.078312
C  -1.179813 1.148408 0.004284
C  -0.168316 -1.131848 -0.221503
C  0.070614 1.795612 -0.055779
C  1.245419 0.919167 -0.203549
C  -2.633741 -0.647536 -0.001663
C  1.104786 -0.501832 -0.276431
C  -0.518043 -2.525742 -0.298422
C  -3.446548 0.587856 0.142537
C  -2.952295 -2.003979 -0.07388
C  0.243565 3.218697 0.019315
C  2.539664 1.548635 -0.272343
C  -1.862181 -2.931392 -0.226194
C  1.516096 3.776071 -0.04743
C  2.670435 2.931957 -0.195668
C  2.760135 -2.178637 0.49371
C  4.042703 -2.814218 0.011335
H  0.26469 -3.282141 -0.40746
H  -3.985867 -2.359171 -0.018788
H  -0.646174 3.845877 0.130223
H  3.420772 0.912939 -0.395714
H  -2.091778 -4.000555 -0.284686
H  1.645225 4.861769 0.010766
H  3.664463 3.388577 -0.25075
H  3.904025 -3.24343 -0.995284
H  4.3588 -3.595152 0.717418
H  4.834614 -2.048417 -0.067271
