program: Gaussian 09
title: 000283875
version: EM64L-G09RevD.01
frameworkgroup: C1[X(C16H18O2S2)]
method: RPBEPBE
basis: SDD
operation: Freq
keyword: #p
keyword: freq=noraman
keyword: PBEPBE/SDD
title: #p freq=noraman PBEPBE/SDD
converged: YES YES NO NO
title: Mulliken charges:
elementType: S S O O C C C C C C C C C C C C C C C C H H H H H H H H H H H H H H H H H H
charge: 0.645253 0.641808 -0.621224 -0.621007 -0.610999 -0.576367 -0.168334 -0.161664 -0.225652 -0.238214 -0.238358 -0.235534 0.446087 0.445137 -0.375746 -0.371993 -0.369363 -0.372695 -0.801696 -0.802614 0.292229 0.273602 0.298672 0.305775 0.303453 0.306466 0.242932 0.245799 0.239136 0.237860 0.238315 0.237419 0.227926 0.228836 0.240365 0.227604 0.240149 0.226636
chargesum: 0.00000
title: Mulliken charges with hydrogens summed into heavy atoms:
elementType: S S O O C C C C C C C C C C C C C C C C
charge: 0.645253 0.641808 -0.621224 -0.621007 -0.045168 0.028080 -0.168334 -0.161664 0.077801 0.068252 0.004574 0.010266 0.446087 0.445137 -0.136610 -0.134134 -0.131048 -0.135276 -0.104569 -0.108225
polarizability: 2.31711683e+02 1.42984796e+01 2.34844478e+02 -1.86920811e+01 2.50733098e-01 2.05562040e+02
1716.lowfreq: -0.0006 0.0018 0.0024 2.9149 4.3796 7.1112 11.6333 18.2605 26.8695
frequency: 11.4262 18.0775 26.7681 33.4281 34.9924 42.4320 48.3757 79.3833 99.9709 117.2861 136.4031 152.1988 155.5989 196.5976 199.5474 258.1001 268.3743 290.1760 308.3321 325.1735 338.7842 348.0858 378.0994 405.6279 407.6461 417.5863 424.6044 500.2014 506.5114 526.5786 576.5753 577.8032 616.1683 626.2427 627.2191 716.0843 716.4306 774.2580 776.6936 777.8949 789.5618 801.6041 820.2780 821.5953 861.8255 861.8969 932.6281 955.1307 956.3491 986.3562 987.1318 993.6077 995.7319 997.9615 998.5764 1048.2532 1048.4520 1048.6924 1050.7864 1061.0181 1076.9823 1114.0034 1114.4696 1180.3960 1181.3226 1192.7389 1217.1091 1217.3436 1240.3691 1264.2358 1293.3245 1293.6896 1376.0830 1376.5134 1390.3300 1390.6001 1397.8032 1398.3695 1423.9925 1432.0424 1471.1171 1472.1573 1473.5121 1474.6088 1475.4360 1475.9725 1591.3664 1591.8249 1599.6695 1600.1079 2977.7809 2978.4807 3010.1350 3043.3816 3059.6652 3060.6979 3088.2178 3089.7908 3114.4632 3117.8504 3119.8502 3120.5130 3121.6145 3134.6722 3136.8224 3141.6499 3143.4806 3143.9417
redmass: 5.0223 4.9606 4.6956 1.0151 1.0162 5.0590 4.4877 4.5561 3.5594 4.0192 4.7324 5.9459 6.4222 3.2991 5.0134 6.4273 6.0590 4.7067 3.9769 5.4352 3.7157 3.5447 5.0406 3.1402 2.9642 5.8877 6.0587 2.7949 3.1314 5.8817 5.8384 5.6962 5.0173 6.9506 6.7763 3.3894 3.3156 1.9859 4.3577 4.4926 9.4191 2.8951 1.3644 1.3514 1.2484 1.2490 1.4502 1.3390 1.3318 1.4326 1.4299 1.3416 1.4311 4.4947 3.8560 1.6696 1.8101 1.9596 2.4939 1.7949 1.6208 1.2891 1.2830 1.1631 1.1607 1.1489 2.8816 2.8852 1.2055 1.1947 1.2739 1.2744 5.3627 5.5073 3.2708 3.2241 1.2223 1.2214 1.0942 1.1190 1.0968 1.0939 1.0562 1.0574 2.3972 2.3900 6.8127 6.7804 6.1082 6.1062 1.0387 1.0389 1.0590 1.0582 1.0950 1.0948 1.0999 1.0999 1.0880 1.0878 1.0986 1.0924 1.0878 1.0958 1.0960 1.1079 1.0977 1.0974
irintensity: 1.4140 2.8349 2.2193 0.6021 0.5355 0.5995 0.4702 5.5762 0.8966 1.4603 2.1943 17.3648 4.7347 2.1944 6.6014 4.7982 0.6932 1.8874 0.4516 6.9162 3.1296 3.3129 1.1249 1.9304 0.5743 5.6686 10.9058 49.4626 13.8574 10.5312 2.1668 3.4971 13.7454 0.2405 1.7188 1.9988 1.4301 20.3177 0.9964 1.3987 10.2916 54.7659 62.7420 32.8201 3.3461 13.2991 2.9799 1.9496 1.5845 0.2039 0.2086 2.8099 2.3584 8.9915 7.6168 24.9070 20.7107 10.6337 7.9558 5.5855 2.5823 13.4133 12.6426 11.6609 3.9831 11.3980 4.3942 4.3246 7.2246 1.6919 2.7664 3.0158 0.1999 0.1740 6.8270 5.2965 12.1316 14.4628 15.6801 4.6586 15.9133 15.4141 12.6828 12.7611 26.6078 40.7323 0.9578 1.2258 1.6766 2.7372 31.9620 30.3031 16.2267 9.4191 19.6890 18.2459 15.8647 15.3879 6.2609 5.0994 1.5246 5.6533 6.1997 22.2259 19.1797 3.2863 19.5667 15.6971
temp: 298.150 k
press: 1.00000 atm
elementType: 16 16 8 8 6 6 6 6 6 6 6 6 6 6 6 6 6 6 6 6 1 1 1 1 1 1 1 1 1 1 1 1 1 1 1 1 1 1
symmnumber: 1
zpe: 773144.5 jmol-1
zpe.correction: 0.294475 hartree
zpe.thermalcorrener: 0.316306 hartree
zpe.thermalcorrenthalpy: 0.317250 hartree
zpe.thermalcorrgfe: 0.238375 hartree
zpe.sumelectzpe: -1565.454299 hartree
zpe.sumelectthermal: -1565.432468 hartree
zpe.sumelectthermalent: -1565.431524 hartree
zpe.sumelectthermalfe: -1565.510399 hartree
dipole: -0.3512 4.2009 -0.1426
dipole: 4.2179
quadrupole: -117.4474 -122.8286 -146.0280
quadrupole: 2.8771 -20.4552 0.4788
quadrupole: 11.3206 5.9394 -17.2600 2.8771 -20.4552 0.4788
hfenergy: -1565.7487739 hartree
pointgroup: C01 [X(C16H18O2S2)]
dipole: -0.3222754 -0.203456 -1.6150977 debye
polarizability: 230.065117|-18.6193047|204.4649411|-12.1527835|4.0656245|237.5881425 unknown
InChI: InChI=1S/C16H18O2S2/c1-13-3-7-15(8-4-13)19(17)11-12-20(18)16-9-5-14(2)6-10-16/h3-10H,11-12H2,1-2H3
charge 0 multiplicity 1
38 atoms
S  -2.328195 -0.677323 3.125568
S  1.8974 1.068409 2.504527
O  -1.535853 -2.146659 2.967489
O  1.536868 2.661846 2.128683
C  -0.830767 0.632982 3.126634
C  0.210433 0.134732 2.157646
C  -2.960917 -0.316094 1.367015
C  2.793168 0.424229 0.949694
C  -2.701758 -1.29418 0.394388
C  2.959647 1.349487 -0.092032
C  -3.700382 0.846966 1.085675
C  3.300478 -0.885883 0.884537
C  -3.932808 0.075649 -1.247527
C  4.176374 -0.377303 -1.366674
C  -3.189083 -1.087482 -0.915225
C  3.65121 0.937343 -1.252758
C  -4.178069 1.037451 -0.231378
C  3.988464 -1.280286 -0.286344
C  -4.479848 0.273735 -2.650152
C  4.949807 -0.800085 -2.603498
H  -1.271656 1.606107 2.865005
H  -0.502023 0.615079 4.179658
H  0.413185 -0.943437 2.304368
H  -0.024491 0.359269 1.106297
H  -2.130649 -2.185885 0.683234
H  2.548724 2.360086 0.032648
H  -3.906416 1.595372 1.860205
H  3.169647 -1.591933 1.713031
H  -2.990871 -1.839142 -1.688721
H  3.789018 1.645301 -2.078934
H  -4.748407 1.942916 -0.470343
H  4.384454 -2.300228 -0.359422
H  -4.564217 1.344263 -2.90626
H  -3.838331 -0.210207 -3.40707
H  -5.490806 -0.167927 -2.745757
H  4.604347 -0.259185 -3.501781
H  6.029859 -0.585447 -2.486397
H  4.850065 -1.882736 -2.795528
