program: Gaussian 09
title: 000283949
version: EM64L-G09RevD.01
frameworkgroup: C1[X(C29H20O2)]
method: RPBEPBE
basis: SDD
operation: Freq
keyword: #pfreq=noraman
keyword: PBEPBE/SDD
title: #p freq=noraman PBEPBE/SDD
converged: YES YES NO NO
title: Mulliken charges:
elementType: O O C C C C C C C C C C C C C C C C C C C C C C C C C C C C C H H H H H H H H H H H H H H H H H H H H
charge: -0.401298 -0.160920 -0.267143 -0.472144 0.245413 0.352596 0.043882 -0.029516 0.188827 0.111583 0.500774 0.236522 -0.382207 0.306331 -0.353494 -0.388045 -0.411680 -0.447269 -0.386097 -0.272069 -0.253438 -0.258590 -0.255086 -0.373487 -0.395504 -0.239607 -0.247638 -0.242900 -0.244799 -0.233789 -0.244354 0.285123 0.358806 0.273551 0.273178 0.231367 0.228746 0.231484 0.271738 0.232806 0.232239 0.234999 0.231204 0.265861 0.255785 0.226921 0.226967 0.229392 0.227856 0.227883 0.229238
chargesum: 0.00000
title: Mulliken charges with hydrogens summed into heavy atoms:
elementType: O O C C C C C C C C C C C C C C C C C C C C C C C C C C C C C
charge: -0.042492 -0.160920 -0.267143 -0.187021 0.245413 0.352596 0.043882 -0.029516 0.188827 0.111583 0.500774 0.236522 -0.108656 0.306331 -0.080316 -0.156679 -0.182935 -0.215785 -0.114360 -0.039263 -0.021199 -0.023591 -0.023882 -0.107626 -0.139719 -0.012687 -0.020670 -0.013508 -0.016942 -0.005906 -0.015116
polarizability: 4.16700725e+02 -4.42246043e+00 3.85370441e+02 2.93931016e+01 -1.55595757e+01 2.10757390e+02
1716.lowfreq: -5.2650 -0.7644 -0.0010 -0.0001 0.0003 4.6442 23.7523 34.8069 50.4235
frequency: 23.6935 34.7811 50.4201 54.7500 56.7411 67.6130 85.3884 98.0786 102.1267 154.9113 162.9745 178.2392 204.8033 209.0304 227.7658 244.0677 258.8559 265.4791 279.9824 294.5309 305.4679 336.4556 380.7289 394.3579 403.2046 411.3336 416.0492 420.0507 448.7132 476.2788 489.6874 509.5397 543.6233 552.9912 566.4188 586.1155 614.4796 615.2675 617.9949 628.2273 639.3710 658.3372 695.5379 698.6107 703.6052 713.8467 734.3014 737.8645 748.9494 757.8998 768.0351 780.8255 796.6125 807.5275 825.1330 842.2962 850.9240 856.8997 880.8617 884.8719 888.4595 915.5730 924.0311 931.3242 938.6485 958.2073 961.1285 976.5324 978.8956 988.7123 990.2411 991.3238 993.1337 995.5877 996.3955 996.7849 1025.9403 1028.5581 1030.5195 1047.3889 1053.7420 1076.6026 1083.4493 1088.5334 1096.9675 1130.2838 1144.1691 1172.9281 1173.4108 1178.3324 1183.3809 1192.2798 1194.0777 1195.1099 1204.9825 1216.6811 1235.4437 1255.0096 1284.8319 1290.5683 1300.8419 1319.7622 1321.1210 1337.7127 1345.6102 1370.5484 1373.2813 1373.8696 1383.1156 1433.5311 1438.0597 1441.8817 1442.1411 1473.0486 1484.5498 1486.1473 1492.4803 1564.7836 1578.6610 1585.2499 1590.3853 1599.5488 1605.2764 1611.2377 1613.1488 1620.1547 1631.3179 2983.5551 3106.7644 3125.1778 3126.8241 3129.5784 3132.0568 3135.3783 3139.8226 3141.8045 3147.1767 3148.2214 3154.3525 3155.6578 3160.4686 3161.3616 3167.5670 3167.6841 3173.4426 3178.1185 3525.6428
redmass: 5.3922 5.8419 4.7691 4.1680 4.8253 4.3048 6.5134 4.7103 4.5661 4.5920 5.0496 5.5100 5.3805 5.3226 5.3394 5.2321 5.2041 1.8264 3.6967 2.5994 5.0679 4.5937 6.4107 6.9543 2.8510 2.8706 4.7820 4.2557 4.1116 4.4800 4.1682 4.0968 4.0299 5.3520 3.4523 5.2246 6.7988 6.4552 6.5986 6.5554 6.8724 6.4041 3.1440 2.7456 2.7149 1.5872 4.8048 3.7674 2.0274 1.9592 1.6892 2.1820 2.6482 2.6549 4.5259 5.4009 1.2540 1.2529 2.3908 1.6443 2.2366 1.9372 1.7276 3.3516 3.0582 1.4342 1.3940 1.4070 1.3922 5.5610 1.5651 3.6893 1.3800 1.3365 1.5626 3.6912 3.1925 2.5517 2.4288 2.5145 2.1244 2.1269 1.6374 1.9216 2.5517 2.6575 1.9941 1.0569 1.0541 1.0656 1.1164 1.2548 1.4429 1.1285 1.5253 2.3888 1.8004 1.6185 2.3936 1.6315 2.0845 1.5896 2.1121 1.3222 3.3445 9.0835 5.9551 4.8170 7.3920 2.3146 2.3390 2.5574 2.2176 2.3796 2.3094 2.5116 2.9698 5.6535 5.8836 6.9998 5.9810 8.3827 5.9321 6.3168 6.2365 7.5366 11.8751 1.0813 1.0884 1.0848 1.0862 1.0852 1.0854 1.0886 1.0922 1.0894 1.0898 1.0940 1.0938 1.0959 1.0948 1.0986 1.0998 1.1000 1.0990 1.0970 1.0658
irintensity: 0.1290 1.2648 0.1983 0.0824 0.1781 1.2645 1.3148 0.3312 0.0842 1.7684 0.8210 2.3986 1.0391 0.1171 2.1812 0.7323 1.0979 58.8153 29.4400 73.2011 22.7668 13.4482 2.7790 0.6580 0.3011 1.7397 0.8495 3.1834 1.4747 5.4599 3.6098 17.0986 1.3030 21.7730 3.2696 2.3336 4.2942 0.7851 6.7139 18.2127 6.1620 1.0187 17.0252 14.3440 26.3554 51.8122 15.2688 4.8747 72.3930 86.7213 54.5446 6.1746 8.5347 1.6264 0.6632 4.8739 2.7624 0.9819 4.9999 2.6783 6.2344 5.7482 9.3426 10.1571 1.9216 0.3214 1.8864 1.0598 0.6993 1.6647 0.2099 0.3948 0.0601 0.4136 0.7370 3.7001 7.8211 19.1066 23.7711 2.4607 4.7471 25.7978 8.5726 19.1145 5.1000 35.5639 39.2485 0.1447 0.0771 0.8358 0.2283 2.5923 2.8553 2.8851 2.9439 24.6913 34.6433 9.3544 19.5556 1.1107 8.1232 21.1664 27.0972 3.4078 85.4156 1.4902 0.9143 6.8471 0.2105 10.0549 30.0939 2.5720 10.1420 31.6314 22.9523 8.7372 7.1467 0.6372 4.6585 4.1379 1.5624 120.6738 5.4352 7.0609 11.2512 35.9421 87.4795 8.5544 13.8671 0.8169 0.1525 2.8891 1.6719 6.0899 25.4374 12.8937 3.3418 33.8882 5.8349 34.4942 29.8475 29.0585 21.1561 29.2334 19.7940 7.3587 7.6269
temp: 298.150 k
press: 1.00000 atm
elementType: 8 8 6 6 6 6 6 6 6 6 6 6 6 6 6 6 6 6 6 6 6 6 6 6 6 6 6 6 6 6 6 1 1 1 1 1 1 1 1 1 1 1 1 1 1 1 1 1 1 1 1
symmnumber: 1
zpe: 1041587.4 jmol-1
zpe.correction: 0.396720 hartree
zpe.thermalcorrener: 0.420676 hartree
zpe.thermalcorrenthalpy: 0.421620 hartree
zpe.thermalcorrgfe: 0.342971 hartree
zpe.sumelectzpe: -1265.465445 hartree
zpe.sumelectthermal: -1265.441489 hartree
zpe.sumelectthermalent: -1265.440545 hartree
zpe.sumelectthermalfe: -1265.519194 hartree
dipole: 0.2448 3.9803 -0.2162
dipole: 3.9937
quadrupole: -149.5324 -171.4739 -177.1283
quadrupole: -2.0937 3.5685 -9.0609
quadrupole: 16.5125 -5.4290 -11.0834 -2.0937 3.5685 -9.0609
hfenergy: -1265.862165 hartree
pointgroup: C01 [X(C29H20O2)]
dipole: -0.130233 -1.5646836 -0.0599338 debye
polarizability: 417.9507694|-6.0279442|386.1260712|-23.0718821|12.8259776|208.7517156 unknown
InChI: InChI=1S/C29H20O2/c30-28-25(19-11-3-1-4-12-19)27-23-17-8-7-15-21(23)22-16-9-10-18-24(22)29(27,31)26(28)20-13-5-2-6-14-20/h1-18,26,31H
charge 0 multiplicity 1
51 atoms
O  1.032467 -0.429993 1.732744
O  0.538499 3.134083 -0.62434
C  0.749301 -0.396846 0.266607
C  1.454434 0.819492 -0.430364
C  -0.744921 -0.072332 0.186152
C  1.048391 -1.776104 -0.316737
C  -0.972204 1.232858 -0.207969
C  0.347695 1.907474 -0.424981
C  -1.670067 -1.134309 0.599448
C  0.053863 -2.79843 -0.209718
C  2.793908 1.282061 0.113466
C  -1.254317 -2.49778 0.432043
C  2.307289 -2.073182 -0.88665
C  -2.248372 1.937325 -0.47093
C  -2.91745 -0.850775 1.217396
C  0.353482 -4.086757 -0.727598
C  -2.116912 -3.530122 0.884197
C  3.951993 1.227282 -0.704041
C  2.914308 1.820038 1.422924
C  2.59634 -3.365566 -1.376534
C  1.608419 -4.372994 -1.302916
C  -3.757667 -1.889087 1.659569
C  -3.355773 -3.235711 1.48784
C  -2.430559 3.281458 -0.043309
C  -3.290837 1.307794 -1.208526
C  5.203501 1.673679 -0.225998
C  4.165283 2.264021 1.904498
C  5.315885 2.188248 1.085842
C  -3.636293 3.96315 -0.318326
C  -4.489441 1.994095 -1.489435
C  -4.670646 3.324222 -1.039314
H  1.584687 0.556945 -1.500428
H  1.977541 -0.712957 1.852345
H  3.073511 -1.293726 -0.939284
H  -3.213542 0.190828 1.368607
H  -0.40666 -4.874111 -0.701492
H  -1.80948 -4.576642 0.794201
H  3.868794 0.853761 -1.733401
H  2.024123 1.899812 2.054438
H  3.57532 -3.57965 -1.81852
H  1.811452 -5.374695 -1.696953
H  -4.70975 -1.653597 2.146523
H  -3.998456 -4.05069 1.838384
H  -1.625484 3.787308 0.496326
H  -3.152425 0.282837 -1.569566
H  6.084026 1.628709 -0.876677
H  4.240651 2.678523 2.916212
H  6.28441 2.538227 1.460286
H  -3.763196 4.996188 0.023788
H  -5.278878 1.495901 -2.063248
H  -5.60304 3.857335 -1.256682
