program: Gaussian 09
title: 000283841
version: EM64L-G09RevD.01
frameworkgroup: C1[X(C8H9NO2)]
method: RPBEPBE
basis: SDD
operation: Freq
keyword: #pfreq=noraman
keyword: PBEPBE/SDD
title: #p freq=noraman PBEPBE/SDD
converged: YES YES NO YES
title: Mulliken charges:
elementType: O O N C C C C C C C C H H H H H H H H H
charge: -0.438454 -0.262210 -0.424046 0.480841 -0.548258 0.295978 -0.366256 -0.370745 -0.201869 -0.633815 0.107532 0.258986 0.239383 0.271105 0.223486 0.303692 0.230339 0.223566 0.230312 0.380436
chargesum: 0.00000
title: Mulliken charges with hydrogens summed into heavy atoms:
elementType: O O N C C C C C C C C
charge: -0.058018 -0.262210 -0.120355 0.480841 -0.289272 0.295978 -0.126873 -0.099640 0.021617 0.050402 0.107532
polarizability: 1.51836050e+02 -2.90545097e+00 1.11936574e+02 -9.85520050e-03 2.81010334e-03 4.59750915e+01
1716.lowfreq: -5.2429 -0.0003 0.0001 0.0003 6.4529 11.3892 62.5441 88.9373 151.0591
frequency: 62.5439 88.9373 151.0591 158.9396 175.4396 240.4746 249.7834 334.8335 372.5469 415.2131 424.7118 518.2110 520.9240 571.9234 594.8131 606.5241 687.0985 714.4624 731.4273 804.1133 861.9051 888.2413 913.0397 978.6881 980.6005 1033.8186 1075.6169 1091.9771 1125.2365 1142.0573 1166.2539 1185.4431 1273.1783 1315.4016 1341.9628 1375.7112 1427.9203 1446.1313 1467.5885 1489.7096 1498.0991 1515.8516 1587.7739 1628.0963 1640.8136 2943.5514 3005.3881 3095.1519 3133.2957 3134.7642 3161.2640 3188.8597 3529.5364 3592.8454
redmass: 7.0981 3.4570 4.9512 1.9412 1.7563 2.5324 3.5878 6.3918 1.1376 6.5558 3.1036 5.8629 2.5177 3.9824 4.7546 1.4414 2.1724 5.4948 3.5890 1.6372 4.7530 1.4903 1.5538 6.0678 1.3309 3.4331 1.7613 1.7457 1.2779 1.5054 2.0007 1.1065 1.6133 1.7049 2.5508 2.9736 3.5805 1.2160 1.0409 2.4141 1.2419 1.8333 5.4056 6.5626 8.1480 1.0378 1.1010 1.0956 1.0915 1.0872 1.0938 1.0956 1.0640 1.0776
irintensity: 3.0104 3.1776 2.5277 0.0170 1.3785 1.5126 0.2123 9.7748 114.6955 0.0294 8.1571 3.6775 18.1031 4.0379 45.5396 127.7940 1.9162 9.2836 84.1330 26.8293 36.7932 5.1400 26.8184 16.5693 1.0440 272.5846 14.0544 1.9040 1.7637 89.1007 6.6622 11.5315 2.6172 13.7064 153.1070 10.6254 25.4835 8.4946 12.8598 21.8545 1.4535 237.2803 46.8518 193.4328 222.9378 95.0274 54.2096 24.8980 7.4093 11.5734 18.9734 3.7281 40.3713 39.1136
temp: 298.150 k
press: 1.00000 atm
elementType: 8 8 7 6 6 6 6 6 6 6 6 1 1 1 1 1 1 1 1 1
symmnumber: 1
zpe: 410676.5 jmol-1
zpe.correction: 0.156418 hartree
zpe.thermalcorrener: 0.166786 hartree
zpe.thermalcorrenthalpy: 0.167730 hartree
zpe.thermalcorrgfe: 0.120402 hartree
zpe.sumelectzpe: -514.657452 hartree
zpe.sumelectthermal: -514.647085 hartree
zpe.sumelectthermalent: -514.646141 hartree
zpe.sumelectthermalfe: -514.693469 hartree
dipole: 3.1615 0.3983 0.0031
dipole: 3.1865
quadrupole: -47.4083 -62.8422 -68.3657
quadrupole: -6.5477 0.0055 0.0012
quadrupole: 12.1304 -3.3035 -8.8270 -6.5477 0.0055 0.0012
hfenergy: -514.8138707 hartree
pointgroup: C01 [X(C8H9N1O2)]
dipole: 1.2458813 0.1311603 -0.0474497 debye
dipolederiv: -1.1462573 0.4166666 0.0125725 0.5362158 -0.5532756 -0.0152029 0.0086447 -0.0108999 -0.4253206 -0.818549 -0.2475581 0.0249804 -0.2510928 -1.0101306 0.0301812 0.0250485 0.0299935 -0.339709 -1.2641566 0.4312033 0.0136236 0.7137302 -0.5440489 -0.024867 0.0054867 -0.0155678 -0.5118472 1.0295673 -0.765085 -0.0082013 -1.0802963 0.3816354 0.0315025 0.0013402 0.0203918 0.1465901 -0.2855485 0.472525 -0.0116816 -0.1746926 -0.0408063 0.0013464 0.0085604 -0.0217588 -0.1987742 -0.5591909 -0.3471074 0.0319833 -0.2751027 0.132776 0.0066816 0.0298516 0.0092867 0.029365 -0.0779878 -0.0521306 -0.0038923 0.5003941 -0.1679917 -0.020019 -0.0208875 -0.0002852 -0.2331842 -0.1511256 -0.0985564 0.0016123 0.1595404 -0.2234566 -0.0047147 -0.0065754 0.0045519 -0.1917343 0.1290639 0.1233419 -0.0132262 -0.0603296 0.1974038 -0.0080169 -0.0075224 -0.0145755 -0.130503 0.6877329 0.0102923 -0.0139447 0.2675352 0.1644935 -0.0050905 -0.0221479 0.0041554 0.3025464 2.0561999 0.099911 -0.0686328 0.0898272 1.365778 -0.0392072 -0.0682823 -0.0395496 0.2272376 0.1143171 0.0064448 0.0017489 0.0228509 -0.041441 0.005729 0.0012692 0.0062883 0.1677353 -0.0929585 -0.067633 0.0114255 -0.0651063 0.0780292 0.005096 0.0114041 0.0051676 0.1669753 0.0365192 0.0717755 0.0028566 0.0678498 0.0570374 0.0013422 0.0030519 0.0011808 0.1780088 0.0757212 -0.0350535 0.0037655 -0.0346782 -0.127374 0.0099005 0.0037415 0.0098542 0.1503757 0.0646358 -0.0421054 0.0108206 -0.0762638 0.1627907 0.0081099 0.0117093 0.0072184 0.3333555 -0.0212546 0.0171904 0.0103703 -0.1613996 0.0298547 0.1240591 0.1041458 0.0831874 -0.1080825 -0.026537 0.0831972 0.0027395 0.1708037 -0.0693717 0.0002095 -0.0000075 0.0032864 0.1267631 -0.0291542 0.0104355 -0.0159641 -0.1761939 0.0167733 -0.1198081 -0.098677 -0.0916092 -0.0870444 0.2789626 -0.087754 0.0070439 -0.1735915 0.1913245 0.0127686 0.0098458 0.0096837 0.3972465 unknown
polarizability: 151.5729385|-3.7904639|112.0078944|-3.6665221|-1.9297905|46.1668832 unknown
InChI: InChI=1S/C8H9NO2/c1-9-7-4-2-3-6(5-7)8(10)11/h2-5,9-10H,1H3
charge 0 multiplicity 1
20 atoms
O  -3.398354 0.409675 0.07465
O  -2.605088 -1.769091 0.114922
N  2.516699 -1.133618 -0.08944
C  1.428054 -0.262891 -0.077304
C  0.103724 -0.782816 -0.013229
C  -1.010501 0.085119 -0.000326
C  1.597528 1.155009 -0.127468
C  -0.837255 1.494678 -0.050763
C  0.473573 2.009047 -0.113819
C  3.907462 -0.694022 -0.151022
C  -2.358774 -0.537549 0.06741
H  -0.075803 -1.864086 0.027021
H  2.602177 1.586267 -0.176707
H  -1.71052 2.150485 -0.039838
H  0.629307 3.093057 -0.153032
H  2.324094 -2.132444 -0.051123
H  4.119716 -0.11654 -1.074217
H  4.56736 -1.576976 -0.146164
H  4.181248 -0.060559 0.717653
H  -4.264244 -0.077643 0.121192
