program: Gaussian 09
title: 000283844
version: EM64L-G09RevD.01
frameworkgroup: C1[X(C10H13NO2)]
method: RPBEPBE
basis: SDD
operation: Freq
keyword: #p
keyword: freq=noraman
keyword: PBEPBE/SDD
title: #p freq=noraman PBEPBE/SDD
converged: YES YES NO NO
title: Mulliken charges:
elementType: O O N C C C C C C C C C C H H H H H H H H H H H H H
charge: -0.452711 -0.272741 -0.421881 -0.044434 0.492715 -0.670435 -0.721401 -0.366714 -0.422264 0.256438 -0.370754 -0.309409 0.097189 0.215026 0.291570 0.212763 0.209795 0.244083 0.236299 0.227235 0.205459 0.235560 0.217572 0.264939 0.269213 0.376888
chargesum: 0.00000
title: Mulliken charges with hydrogens summed into heavy atoms:
elementType: O O N C C C C C C C C C C
charge: -0.075823 -0.272741 -0.130311 0.170592 0.492715 -0.003794 -0.052408 -0.131154 -0.204692 0.256438 -0.105815 -0.040196 0.097189
polarizability: 2.18866220e+02 6.12523336e+00 1.17238730e+02 -1.10518828e+00 6.67954047e+00 6.81262729e+01
1716.lowfreq: -14.2958 -6.5715 -3.9282 -0.0007 -0.0006 0.0001 44.3161 62.9742 94.1413
frequency: 44.2637 62.9399 94.1375 106.7813 118.2083 195.2363 209.4039 241.9807 265.8968 269.7970 349.6086 375.6996 413.8813 436.6376 450.6132 456.3163 503.5778 514.3243 575.4438 586.4948 629.4430 683.7542 717.3145 754.9349 810.7711 822.1492 840.2914 851.2477 922.1441 945.2869 973.9823 977.7172 984.3234 986.9681 1014.1250 1120.1325 1133.3552 1152.9191 1159.6688 1184.0623 1201.3480 1288.6050 1311.0119 1322.1739 1329.1658 1346.3866 1374.8393 1379.9807 1396.8321 1446.1251 1463.4769 1467.7332 1470.3590 1483.7030 1487.5647 1526.5836 1570.6074 1628.5570 1640.5112 2976.4171 2981.4946 2984.3630 3070.7480 3080.7946 3088.8578 3096.4912 3117.9435 3144.6236 3165.9160 3173.3380 3536.8569 3543.3870
redmass: 4.1931 3.9770 4.2604 4.2675 4.4591 3.2331 1.0768 1.4393 2.3899 4.6978 2.8880 2.9473 2.4387 1.3800 2.7824 3.6394 3.2675 3.6388 1.2131 4.5797 6.9438 3.6121 4.7956 4.6733 3.1930 1.3270 1.8396 2.8515 1.2169 1.4304 1.3614 2.0113 1.3833 4.3097 2.7546 1.4491 2.2343 1.5347 1.8014 2.1125 1.2238 1.5415 1.4404 2.6504 1.4047 1.5246 3.9351 1.2140 1.2218 3.7315 1.1234 1.0680 1.3406 1.1743 1.1080 3.3495 4.7951 6.6601 7.7695 1.0432 1.0443 1.0691 1.0981 1.0995 1.0998 1.0996 1.0896 1.0876 1.0957 1.0951 1.0641 1.0765
irintensity: 0.7081 1.4192 0.2821 0.6496 0.2613 0.5420 0.3934 0.3350 0.7581 0.4389 0.3233 7.1888 16.4593 100.4675 11.3943 9.5690 16.5985 8.6533 83.1683 51.9209 2.8892 66.4507 1.6260 19.4857 1.6555 4.8637 62.5180 3.2966 3.5798 5.0640 1.3258 1.0925 1.8565 132.0464 239.7272 16.1309 17.7244 241.1961 4.4110 69.6557 15.0459 17.3751 8.8705 134.4247 10.4541 15.3955 204.6024 21.6404 30.8767 9.9483 7.2888 5.5743 4.3030 18.1770 5.0520 193.4074 35.6861 705.4963 136.7504 25.4228 22.5135 24.8255 15.3740 57.1928 27.7271 39.0401 18.0683 4.2708 17.4695 2.5029 50.2361 41.8853
temp: 298.150 k
press: 1.00000 atm
elementType: 8 8 7 6 6 6 6 6 6 6 6 6 6 1 1 1 1 1 1 1 1 1 1 1 1 1
symmnumber: 1
zpe: 556458.7 jmol-1
zpe.correction: 0.211944 hartree
zpe.thermalcorrener: 0.224974 hartree
zpe.thermalcorrenthalpy: 0.225918 hartree
zpe.thermalcorrgfe: 0.172294 hartree
zpe.sumelectzpe: -593.113964 hartree
zpe.sumelectthermal: -593.100933 hartree
zpe.sumelectthermalent: -593.099989 hartree
zpe.sumelectthermalfe: -593.153613 hartree
dipole: 5.3507 1.9696 0.3138
dipole: 5.7103
quadrupole: -68.3310 -75.6363 -80.7135
quadrupole: -6.4276 -1.8531 1.1668
quadrupole: 6.5626 -0.7427 -5.8199 -6.4276 -1.8531 1.1668
hfenergy: -593.3259075 hartree
pointgroup: C01 [X(C10H13N1O2)]
dipole: 2.1148087 0.7485976 0.1199957 debye
dipolederiv: -1.0144713 0.4659475 0.0884661 0.7920674 -0.8026998 -0.078733 0.1506778 -0.0757662 -0.4509936 -1.1424969 -0.3202546 -0.0435452 -0.5511406 -0.91705 -0.0922243 -0.0765346 -0.0911059 -0.3618899 -2.020053 0.043121 -0.0098384 -0.2227375 -0.2361029 0.1320993 0.1460361 0.1393363 -0.4762494 0.7973257 -0.1705855 0.0258118 -0.5835462 0.3482275 -0.0645834 -0.146825 -0.0768817 0.3652655 1.9544989 0.0926231 0.0232956 0.4438779 0.088953 -0.0073938 0.0056007 -0.0140873 0.1448798 -0.1140222 -0.0205204 0.0127148 0.1342162 -0.0024692 0.0939168 0.0305609 0.1385974 -0.0918652 -0.1106582 -0.0000533 0.0376354 0.0567794 0.0399734 0.0599279 0.0453799 0.0621039 0.0490148 -0.6024368 -0.0400056 0.0032373 -0.6608899 -0.0699453 0.0173396 -0.1198189 0.0319585 -0.23363 -0.7742679 -0.0395477 -0.0139401 0.4372417 0.0620807 0.0483703 0.078831 0.049441 -0.2270629 -1.3861181 -0.076952 0.0018114 -0.1340061 -0.2725387 -0.040624 0.0126627 -0.037659 -0.0553972 0.6621447 -0.0507187 -0.0207314 -0.1993215 0.0942406 0.0422939 -0.0550259 0.0319725 -0.0868804 0.534225 0.1187813 0.0134557 0.3356125 0.1635534 0.0425446 0.0410178 0.0397972 -0.0817703 2.643595 0.044986 -0.0314861 0.0664638 1.3185191 0.1924385 -0.047448 0.1895636 0.2556483 -0.0122069 -0.0554637 -0.0771564 0.0613562 -0.0499231 -0.081527 -0.0159273 -0.0625576 -0.0754857 0.1425088 0.0074812 -0.0119383 0.1108189 0.0985458 -0.0380598 -0.0111855 -0.0710766 0.2876327 -0.0661166 0.1377363 0.0070927 0.2099944 -0.0459985 -0.0069843 -0.0109985 -0.0405307 0.0634413 0.059149 -0.0313039 -0.0762191 -0.0968025 -0.0175711 -0.1225027 -0.0612368 -0.058935 -0.0331418 -0.0428417 -0.0981638 0.0899505 -0.1082258 0.0515685 0.0423249 0.0920727 0.0231783 0.0501897 0.1100502 0.0104438 -0.0400212 -0.0271861 0.0240286 0.1187328 -0.0117749 0.1101351 -0.0967216 -0.0993882 0.0847696 0.0249792 0.1452463 -0.0188929 -0.0274321 0.0113416 -0.0090339 0.1077926 0.0765423 -0.0259401 -0.004479 -0.0961109 -0.0278579 -0.0950281 -0.0629743 -0.1374636 -0.0452615 -0.0132514 0.0985467 0.0195688 0.1183049 -0.0160743 -0.0235543 0.0295722 -0.0305263 0.152994 0.0086746 -0.1056737 -0.0133574 -0.078305 -0.0781909 -0.0388466 -0.0062435 -0.0390328 0.1551826 0.1012901 -0.0573875 -0.0099622 -0.0286106 -0.0080995 -0.027719 -0.0035226 -0.0246493 0.1451171 0.0750174 0.0743478 0.0146003 0.0666688 0.0203534 -0.0247125 0.0145373 -0.0247123 0.1488624 0.2333075 -0.0862139 -0.0099447 -0.1917659 0.2533699 -0.0200637 -0.0287751 -0.0220657 0.3903287 unknown
polarizability: 219.011267|4.7833802|117.2165678|-0.8140697|6.2464731|68.0033874 unknown
InChI: InChI=1S/C10H13NO2/c1-7(2)11-9-5-3-8(4-6-9)10(12)13/h3-7,11-12H,1-2H3
charge 0 multiplicity 1
26 atoms
O  -4.105662 0.904176 0.185711
O  -3.894217 -1.374758 -0.215308
N  2.311183 0.658864 -0.043987
C  3.368698 -0.360062 -0.200109
C  0.944443 0.415813 -0.02879
C  3.599397 -1.161225 1.107183
C  4.6630 0.333281 -0.672445
C  0.395564 -0.890511 -0.238595
C  0.039225 1.505857 0.186423
C  -1.886729 0.002987 -0.028099
C  -0.993194 -1.081515 -0.240559
C  -1.345168 1.302129 0.186567
C  -3.334668 -0.260297 -0.036024
H  3.045391 -1.062102 -0.994926
H  2.619911 1.613876 0.145059
H  4.321183 -1.981724 0.938816
H  4.002323 -0.501799 1.897776
H  2.656747 -1.600269 1.477616
H  4.508911 0.855507 -1.633437
H  5.469386 -0.4082 -0.805972
H  5.010317 1.070986 0.077369
H  1.054465 -1.748178 -0.401576
H  0.443333 2.513118 0.349047
H  -1.416613 -2.078586 -0.403546
H  -2.027829 2.140654 0.351042
H  -5.064297 0.641679 0.165262
