program: Gaussian 09
title: 000283868
version: EM64L-G09RevD.01
frameworkgroup: C1[X(C11H11FO6S)]
method: RPBEPBE
basis: SDD
operation: Freq
keyword: #p
keyword: freq=noraman
keyword: PBEPBE/SDD
title: #p freq=noraman PBEPBE/SDD
converged: YES YES NO NO
title: Mulliken charges:
elementType: S F O O O O O O C C C C C C C C C C C H H H H H H H H H H H
charge: 1.090849 -0.343610 -0.279647 -0.241064 -0.474669 -0.476789 -0.213759 -0.244127 0.451025 -0.138985 -0.102377 -0.364947 -0.333199 -0.225902 -0.219009 0.310033 0.326749 -0.751701 -0.746629 0.291910 0.290952 0.282207 0.290453 0.289178 0.254376 0.257411 0.255926 0.260749 0.253441 0.251152
chargesum: 0.00000
title: Mulliken charges with hydrogens summed into heavy atoms:
elementType: S F O O O O O O C C C C C C C C C C C
charge: 1.090849 -0.343610 -0.279647 -0.241064 -0.474669 -0.476789 -0.213759 -0.244127 0.451025 0.152926 -0.102377 -0.073995 -0.050991 0.064551 0.070170 0.310033 0.326749 0.016012 0.018713
polarizability: 2.24200816e+02 4.79395324e-01 1.54052360e+02 3.12899105e+00 -2.19449273e+01 1.21966176e+02
1716.lowfreq: -4.6391 -3.5291 -0.0015 -0.0010 0.0017 2.4169 14.8876 29.2292 34.0914
frequency: 14.7022 29.2068 34.0805 41.9531 48.5069 65.0953 69.0745 77.5994 86.3462 91.1372 132.2278 147.7350 176.1053 212.1447 223.7085 228.6717 257.4744 291.9653 309.9251 330.9583 356.0873 366.8928 403.5644 442.6652 449.3837 507.1214 524.2590 554.8590 562.9261 566.5781 587.8211 614.7991 629.3615 663.6556 723.1953 803.5884 833.4428 846.5173 848.7687 856.3280 877.5588 901.3765 975.4659 978.5624 985.4711 990.7303 992.1043 995.5011 1026.1203 1042.9208 1043.3836 1047.4844 1117.2083 1169.9244 1185.0406 1197.2186 1210.7822 1295.1056 1321.5040 1334.6022 1385.1673 1386.3600 1389.4348 1407.8429 1451.2688 1451.5710 1452.5837 1453.4225 1468.7800 1593.8755 1596.3475 1657.3801 1682.9483 3008.7055 3009.0442 3044.0111 3097.8587 3101.0223 3145.4816 3146.3265 3151.3056 3162.0058 3171.6836 3185.0484
redmass: 9.8115 4.8823 6.0262 1.7211 2.5089 3.4157 5.5927 3.2602 1.5061 2.6616 8.3496 9.3865 12.1393 6.4192 8.5488 9.0425 7.7065 7.9973 4.3571 8.6543 6.5683 6.3938 2.8871 6.4863 5.5778 4.4357 4.3971 3.7855 4.5162 4.6353 5.6712 6.5108 5.9541 5.7833 4.0330 3.5828 3.5075 2.7584 1.5617 11.4764 2.8318 5.8963 2.5163 1.3870 1.9901 2.3428 2.4165 7.0951 4.1709 1.6649 1.6657 2.3222 1.3587 2.8931 1.1870 3.2349 2.0519 1.3273 1.1860 1.7730 1.2378 1.2783 5.2170 2.7593 1.0562 1.0562 1.0496 1.0512 2.3663 7.3550 6.1463 9.6981 10.1561 1.0379 1.0375 1.0857 1.0964 1.0951 1.1020 1.1013 1.0903 1.0902 1.0969 1.0962
irintensity: 0.0701 0.7386 1.9525 1.5490 0.0149 4.0915 2.1397 0.4285 1.3292 3.7756 5.4108 1.3456 0.0537 5.4700 3.5826 4.8807 15.5656 3.4444 1.6228 28.5897 14.4621 3.5135 0.4887 20.3547 27.9659 32.7414 3.4736 42.9124 93.2766 55.2915 16.2512 1.5692 1.9114 18.4747 1.4013 26.6739 110.1260 157.0315 57.7243 47.3779 74.3130 164.8070 107.0544 4.1670 16.5981 7.5652 6.4459 67.1728 195.7726 7.9973 12.4640 18.3485 7.3742 301.4624 26.8629 355.3040 4.9785 4.3272 5.0012 19.9135 57.7749 50.5865 30.1479 5.0958 33.3262 18.7126 20.2965 16.2461 9.4640 1.3152 3.2583 123.7022 209.0393 0.5112 0.3514 8.7085 4.5811 4.5335 6.8428 7.8751 1.2539 2.8066 2.5678 0.4096
temp: 298.150 k
press: 1.00000 atm
elementType: 16 9 8 8 8 8 8 8 6 6 6 6 6 6 6 6 6 6 6 1 1 1 1 1 1 1 1 1 1 1
symmnumber: 1
zpe: 540101.8 jmol-1
zpe.correction: 0.205714 hartree
zpe.thermalcorrener: 0.226204 hartree
zpe.thermalcorrenthalpy: 0.227148 hartree
zpe.thermalcorrgfe: 0.152222 hartree
zpe.sumelectzpe: -1373.444568 hartree
zpe.sumelectthermal: -1373.424078 hartree
zpe.sumelectthermalent: -1373.423134 hartree
zpe.sumelectthermalfe: -1373.498060 hartree
dipole: -6.9081 -1.4741 2.4137
dipole: 7.4646
quadrupole: -148.8419 -107.7348 -119.4698
quadrupole: 7.6777 -10.6395 1.5912
quadrupole: -23.4931 17.6141 5.8790 7.6777 -10.6395 1.5912
hfenergy: -1373.6502817 hartree
pointgroup: C01 [X(C11H11F1O6S1)]
dipole: -2.7305506 0.135544 -1.0726232 debye
polarizability: 223.8470137|5.7002951|143.6186963|-0.0845478|-26.7837462|132.7536418 unknown
InChI: InChI=1S/C11H11FO6S/c1-7(13)17-11(18-8(2)14)9-3-5-10(6-4-9)19(12,15)16/h3-6,11H,1-2H3
charge 0 multiplicity 1
30 atoms
S  4.480186 0.358529 -0.111527
F  4.74986 1.830287 0.989617
O  -2.258728 1.25126 -0.37489
O  -2.142586 -1.085698 -0.51326
O  5.142007 -0.889246 0.653115
O  4.942781 0.816549 -1.580303
O  -4.269467 0.761181 0.719746
O  -2.123428 -2.349232 1.452882
C  -0.148972 0.2036 0.166626
C  -1.654697 0.095754 0.264324
C  2.612058 0.30256 0.008743
C  0.636011 -0.503146 1.112186
C  0.468774 0.959079 -0.85978
C  2.044332 -0.458583 1.042908
C  1.875086 1.018569 -0.94838
C  -3.636249 1.479032 -0.074187
C  -2.422316 -2.247475 0.244382
C  -4.138574 2.66456 -0.856807
C  -3.106946 -3.279684 -0.615666
H  -2.014189 -0.021734 1.303068
H  0.144674 -1.094584 1.89202
H  -0.151525 1.505715 -1.574426
H  2.670563 -0.999796 1.758338
H  2.377704 1.591463 -1.733487
H  -5.146078 2.937266 -0.512382
H  -4.17662 2.410311 -1.931203
H  -3.45258 3.520674 -0.745257
H  -4.168598 -2.999997 -0.742773
H  -2.650289 -3.318648 -1.617639
H  -3.054197 -4.263965 -0.128481
