program: Gaussian 09
title: 000283849
version: EM64L-G09RevD.01
frameworkgroup: C1[X(C9H9Cl2NO4S)]
method: RPBEPBE
basis: SDD
operation: Freq
keyword: #p
keyword: freq=noraman
keyword: PBEPBE/SDD
title: #p freq=noraman PBEPBE/SDD
converged: YES YES NO NO
title: Mulliken charges:
elementType: Cl Cl S O O O O N C C C C C C C C C H H H H H H H H H
charge: -0.020747 -0.049286 1.011576 -0.266514 -0.523728 -0.472815 -0.283547 -0.643393 -0.060358 -0.170319 -0.234953 -0.197091 -0.179958 -0.101460 0.409503 -0.244716 -0.567716 0.306984 0.296829 0.378938 0.272256 0.272423 0.243891 0.257898 0.268961 0.297346
chargesum: 0.00000
title: Mulliken charges with hydrogens summed into heavy atoms:
elementType: Cl Cl S O O O O N C C C C C C C C C
charge: -0.020747 -0.049286 1.011576 -0.266514 -0.523728 -0.472815 -0.283547 -0.264456 -0.060358 0.136664 0.061875 0.075165 0.092465 -0.101460 0.409503 0.257072 -0.001409
polarizability: 1.77471681e+02 -3.00446085e+01 1.57870194e+02 5.56288202e+00 7.77847193e+00 1.45931954e+02
1716.lowfreq: -5.7528 -3.5843 -0.0014 -0.0011 -0.0009 4.7231 14.8725 26.4503 38.9840
frequency: 14.8367 26.4294 38.9790 50.2167 72.4271 81.4167 107.3725 123.7481 126.7373 170.6229 202.0817 211.3475 229.3064 243.9603 276.7317 289.4352 338.4264 372.2894 390.4244 407.1547 410.5966 456.8207 490.7048 506.9919 534.0850 604.5756 610.3473 652.7787 669.8618 696.9528 699.7500 706.1614 808.3658 820.1771 824.7246 835.0276 917.4581 951.0699 952.7337 969.1253 973.3986 980.2386 1017.4839 1046.2348 1067.3456 1069.7552 1109.7362 1127.1739 1177.4164 1180.1949 1242.5204 1286.5219 1299.9844 1330.4954 1374.1900 1381.9328 1384.6454 1432.9610 1443.5809 1450.4798 1566.3921 1593.9085 1636.3869 3015.1173 3061.6122 3119.4516 3149.4455 3160.6280 3172.8519 3182.8389 3189.7100 3522.5532
redmass: 14.6893 5.3806 13.6910 4.7480 13.1963 6.2315 7.3078 10.6290 5.4928 6.9807 7.9735 13.7625 10.8963 9.0670 6.9761 7.4145 2.9231 6.3680 13.2422 4.1462 3.6482 3.4037 7.6441 3.5724 1.1987 4.7980 7.0845 5.5416 5.0394 4.8138 9.6089 5.7064 3.9104 1.5879 3.2391 1.4679 2.4673 1.4449 2.2201 1.8495 3.8181 7.0691 2.0859 2.7570 3.1012 3.2635 1.3418 2.0199 1.2855 1.1376 1.1627 1.2336 1.1958 1.8179 1.4334 4.7654 4.3799 1.1027 1.0935 2.0802 6.0700 8.1808 9.8141 1.0633 1.0588 1.1017 1.1081 1.0901 1.0896 1.0966 1.0979 1.0787
irintensity: 0.2875 1.3670 1.3680 1.4487 1.4962 0.7675 4.5241 4.2861 6.7401 1.0183 5.0356 1.6914 12.1292 1.1372 1.5595 17.2798 27.7043 3.5704 58.2423 23.2354 23.2337 25.9438 10.7985 114.2351 98.4213 18.2985 0.4382 69.8910 110.0210 1.6197 31.8098 58.5514 37.6724 59.1782 92.7200 39.5480 7.0936 3.2030 22.5889 23.5391 49.8325 26.4664 74.4053 36.7766 60.3296 20.7111 11.1303 349.7975 16.0775 4.0651 5.8744 2.4034 78.4531 370.9566 60.2726 19.9772 8.9951 41.8869 17.1130 53.2034 41.7289 2.0383 188.6391 19.8950 13.5439 2.8797 9.8819 3.7983 2.1938 0.7713 5.1172 86.2298
temp: 298.150 k
press: 1.00000 atm
elementType: 17 17 16 8 8 8 8 7 6 6 6 6 6 6 6 6 6 1 1 1 1 1 1 1 1 1
symmnumber: 1
zpe: 452424.3 jmol-1
zpe.correction: 0.172319 hartree
zpe.thermalcorrener: 0.190202 hartree
zpe.thermalcorrenthalpy: 0.191146 hartree
zpe.thermalcorrgfe: 0.122629 hartree
zpe.sumelectzpe: -2020.743176 hartree
zpe.sumelectthermal: -2020.725293 hartree
zpe.sumelectthermalent: -2020.724349 hartree
zpe.sumelectthermalfe: -2020.792866 hartree
dipole: -0.5066 -2.9576 -0.7952
dipole: 3.1043
quadrupole: -111.0229 -139.1791 -117.4674
quadrupole: -4.2012 10.3050 6.9477
quadrupole: 11.5336 -16.6226 5.0891 -4.2012 10.3050 6.9477
hfenergy: -2020.9154949 hartree
pointgroup: C01 [X(C9H9Cl2N1O4S1)]
dipole: 0.2439414 -1.1962457 0.032993 debye
dipolederiv: -0.4145396 -0.3846247 -0.0785726 -0.4414551 -0.5286973 -0.0688277 -0.0887211 -0.0680058 -0.1053891 -0.1991895 0.0244795 0.0728266 0.0300796 -0.211467 -0.0517214 0.1051922 -0.1422591 -0.4780168 2.5875663 -0.1408629 0.0544713 0.0335346 1.7960151 0.1519939 -0.157706 0.2323569 1.1945688 -1.8332555 0.5355344 0.0733255 0.5626097 -0.6559044 -0.0066214 0.1052399 0.0539232 -0.3198635 -0.6677983 -0.057592 0.0109837 -0.0218932 -0.6876861 0.0164793 -0.0963817 0.1524573 -0.5257434 -0.6489762 -0.0542109 -0.0490951 -0.0725692 -0.5792196 -0.0634273 0.0724333 -0.182391 -0.5696482 -0.7917943 -0.0150016 0.0989495 0.1090681 -0.5947008 0.2216787 0.0548872 0.2722917 -0.573643 -1.4949492 0.4262775 -0.1539923 0.6298884 -1.0321394 0.0781081 -0.3727092 0.2065337 -0.6201631 -0.1135263 0.0914037 0.0161516 0.0380157 -0.2114081 -0.0105272 -0.0066043 -0.0688091 -0.1375874 -0.0352359 -0.0476005 0.093251 0.0558284 -0.0097685 0.0817673 -0.1506192 -0.1903763 -0.0509027 -0.0509854 0.0855046 -0.0384697 -0.0838037 -0.0782718 -0.1155814 0.2256168 0.1922289 -0.0068553 -0.2607122 -0.1306571 -0.1053502 -0.1698972 -0.1793099 -0.1719175 -0.0695823 -0.0877831 -0.0598389 -0.200268 -0.1751829 0.080137 -0.1655241 -0.3047323 0.0540286 0.0375176 -0.0006819 -0.0018203 0.5730747 0.66397 0.1635691 0.7312359 0.8104196 0.0734357 0.1671885 0.06829 0.1755736 2.1609651 -0.5101257 -0.1228464 -0.9155789 1.134142 -0.4044653 0.2469481 -0.6178199 0.7436795 0.6137183 -0.2437253 0.0414992 -0.5518457 0.5624311 0.030601 0.3059106 -0.144918 0.1072025 0.1225785 -0.0596253 -0.097404 0.0172573 0.0574831 0.0840199 -0.2677206 0.1322981 0.6565794 0.160875 -0.0098217 -0.052763 -0.0077199 0.1203591 -0.0163927 -0.0459572 -0.0003288 0.1098502 0.1647566 -0.029768 0.0171696 -0.0042544 0.0952699 0.0595083 0.0075032 0.0216382 0.1089951 0.1034741 0.0917575 0.0137227 0.1642612 0.2215746 0.0503545 -0.0133781 0.0305692 0.2910572 0.1174837 -0.0543675 -0.0101341 -0.0629799 0.050026 0.0634117 -0.0136667 0.0529427 0.0578093 0.0947486 -0.0490688 -0.0707529 -0.0630068 0.0965873 -0.006185 -0.0670156 0.0030603 0.0340071 0.1024775 0.0229119 0.0619518 0.1107597 -0.0051369 -0.0603333 -0.0555198 0.024865 -0.0693121 -0.0944662 -0.0064618 -0.0060184 0.0113554 0.0227974 -0.0001607 0.0149624 0.0437902 0.1260675 0.0343839 0.0891314 -0.0349007 0.1245494 -0.0013842 0.0324938 0.0090182 0.03511 -0.0549905 -0.0304056 -0.0622738 0.0222907 -0.0579152 0.1127211 -0.02172 0.0531639 -0.0189825 -0.031616 unknown
polarizability: 175.3856465|28.4636868|162.8443012|12.5449508|-3.7769391|143.0438807 unknown
InChI: InChI=1S/C9H9Cl2NO4S/c10-5-6-16-9(13)12-17(14,15)8-3-1-7(11)2-4-8/h1-4,12H,5-6H2
charge 0 multiplicity 1
26 atoms
Cl -4.394766 -2.956448 -0.681526
Cl 4.26759 -2.176682 -1.824478
S  -0.418655 2.03532 0.177556
O  3.254418 0.364051 -0.045635
O  -0.695843 3.114963 -1.000257
O  -0.402756 2.451671 1.736119
O  1.430288 -0.305889 1.296339
N  1.257595 1.400511 -0.314631
C  -1.5386 0.545158 -0.070582
C  -1.692213 -0.36511 0.987533
C  -2.208691 0.452747 -1.301292
C  -2.578563 -1.447186 0.792339
C  -3.091478 -0.63356 -1.487854
C  -3.257432 -1.562841 -0.439198
C  1.925703 0.424744 0.402577
C  4.082695 -0.699687 0.574425
C  3.802777 -2.081148 -0.001211
H  -1.139676 -0.240817 1.922251
H  -2.061625 1.209074 -2.078588
H  1.746936 1.992806 -0.995024
H  -2.732627 -2.18563 1.583352
H  -3.639253 -0.75027 -2.426534
H  3.882173 -0.720362 1.662909
H  5.116072 -0.376014 0.379992
H  4.424665 -2.835978 0.505193
H  2.740068 -2.352525 0.063624
