program: Gaussian 09
title: 000283829
version: EM64L-G09RevD.01
frameworkgroup: C1[X(C9H9NO3)]
method: RPBEPBE
basis: SDD
operation: Freq
keyword: #pfreq=noraman
keyword: PBEPBE/SDD
title: #p freq=noraman PBEPBE/SDD
converged: NO YES NO NO
title: Mulliken charges:
elementType: O O O N C C C C C C C C C H H H H H H H H H
charge: -0.267134 -0.254499 -0.392091 -0.002524 0.263397 0.212582 -0.317211 -0.315334 -0.551966 -0.349113 0.502032 -0.373684 -0.381172 0.233161 0.230009 0.233946 0.230528 0.247923 0.252699 0.275892 0.202844 0.319716
chargesum: 0.00000
title: Mulliken charges with hydrogens summed into heavy atoms:
elementType: O O O N C C C C C C C C C
charge: -0.267134 -0.254499 -0.072375 -0.002524 0.263397 0.212582 0.145958 0.149139 -0.304044 -0.096414 0.502032 -0.097792 -0.178327
polarizability: 2.18772264e+02 2.85248927e+00 1.09571485e+02 6.84922118e-02 -1.84521866e+00 5.43276472e+01
1716.lowfreq: 0.0008 0.0008 0.0010 1.9438 6.3631 11.6520 58.9403 116.4760 117.9586
frequency: 58.9321 116.4655 117.9512 131.3673 174.4055 271.3553 293.1789 317.6052 332.6968 388.7900 448.3687 449.1107 454.0519 459.8913 497.0922 578.8470 611.3190 651.8401 721.4469 724.3877 780.0621 835.5083 861.6123 869.1655 880.8103 906.9741 927.4615 940.9853 970.0360 1018.2693 1031.6652 1086.3860 1099.5153 1155.3024 1194.7730 1206.3675 1243.5652 1259.1212 1281.0467 1288.2007 1350.8114 1354.3954 1377.0806 1394.9254 1420.9060 1455.6938 1459.2470 1492.2257 1543.1928 1582.9906 1621.5406 2962.4868 2999.5509 3008.4845 3100.9751 3103.8819 3145.3409 3156.8452 3178.3390 3276.6961
redmass: 5.3364 4.5771 4.9270 2.9271 3.6922 5.0853 4.8653 3.0532 5.2122 4.4760 1.5728 3.7112 2.3950 6.8956 4.0440 5.7385 4.4096 2.9236 5.7987 3.7351 5.3352 1.3872 3.4929 1.4857 3.2621 7.4483 1.5503 2.8484 1.3309 3.1221 3.3153 1.9656 2.8858 1.4340 1.4408 1.3248 1.3209 1.5564 1.2886 2.3399 1.3710 1.3368 2.7565 2.0036 4.7689 1.1080 1.1256 3.2386 5.8476 7.3523 6.9594 1.0871 1.0675 1.0609 1.0990 1.1046 1.0915 1.0883 1.0972 1.0653
irintensity: 0.0221 20.5223 21.7625 21.3922 15.0184 2.5350 8.7279 2.6774 25.3684 2.6128 50.8890 19.1052 41.8470 1.0466 1.2391 10.5081 15.0248 14.0098 18.0162 3.0512 27.2948 32.2710 78.4757 11.0143 9.1911 143.5197 52.3981 4.7786 0.4487 8.2265 59.1095 0.4484 29.8208 8.5665 21.0846 30.1795 11.4256 162.9989 1.3334 160.0638 8.0814 9.4534 9.6071 95.9619 2.7326 0.0224 14.0626 142.5655 3.2722 39.5703 15.9894 56.0808 59.6832 49.2055 34.9506 17.7914 4.1962 2.0610 2.4840 16.2333
temp: 298.150 k
press: 1.00000 atm
elementType: 8 8 8 7 6 6 6 6 6 6 6 6 6 1 1 1 1 1 1 1 1 1
symmnumber: 1
zpe: 434373.3 jmol-1
zpe.correction: 0.165444 hartree
zpe.thermalcorrener: 0.176514 hartree
zpe.thermalcorrenthalpy: 0.177458 hartree
zpe.thermalcorrgfe: 0.128402 hartree
zpe.sumelectzpe: -627.747167 hartree
zpe.sumelectthermal: -627.736097 hartree
zpe.sumelectthermalent: -627.735153 hartree
zpe.sumelectthermalfe: -627.784210 hartree
dipole: 4.4419 -3.0445 0.1538
dipole: 5.3873
quadrupole: -71.8457 -72.2989 -77.3508
quadrupole: 9.6739 -0.4427 0.4159
quadrupole: 1.9861 1.5329 -3.5190 9.6739 -0.4427 0.4159
hfenergy: -627.9126114 hartree
pointgroup: C01 [X(C9H9N1O3)]
dipole: -1.7512643 -1.1918121 -0.0715969 debye
dipolederiv: -1.2807277 -0.3554774 0.0392756 -0.5220974 -0.5499154 0.050324 -0.0369706 -0.0130513 -0.2884041 -1.7656991 0.0736652 -0.1217026 0.1401893 -0.3632818 0.0352561 0.0037334 0.0017244 -0.2826528 -1.2849126 0.037972 -0.0153105 0.8477792 0.0162233 0.0309707 0.0171818 0.0176995 -0.3911074 0.7976037 0.0237655 0.0161893 -0.6995159 -0.0405633 -0.009182 -0.0106635 0.0038642 -0.1557953 0.6013843 0.4414805 -0.0121507 1.1547485 0.357924 -0.0290742 0.0950566 -0.0158 0.0488442 1.2971494 -0.1679493 0.0852373 -0.7202927 0.0017738 -0.0572764 -0.0236765 -0.0562735 0.0280164 0.7683155 0.1197697 -0.106694 -0.2312663 0.1109421 0.0334019 -0.144383 0.035349 0.3226966 0.7040999 0.0659812 0.097183 0.5352132 0.217437 0.0950187 0.1340444 0.0792134 0.3303306 -0.0176468 -0.1643946 0.0169683 0.036885 0.0171809 0.013532 0.0350279 0.0258226 -0.1927449 -0.2655156 0.0450766 -0.0203915 -0.1465684 0.1169568 0.0052703 -0.0622618 0.0250919 -0.1534312 -0.1250956 0.0650189 -0.0086261 0.0836453 -0.0451909 0.0024847 -0.0023654 0.0014353 0.0228286 -0.0099855 -0.0186444 0.0083085 -0.032983 -0.0060682 0.0066202 0.0054592 0.0079145 -0.1513318 0.3906899 -0.090138 0.0088054 -0.4591242 0.3298902 0.0087174 -0.0087192 0.0098885 -0.0942011 -0.0147814 -0.0055194 -0.0141492 0.1112065 0.0812702 -0.0494869 0.096719 0.0139552 -0.1459371 -0.0562376 -0.0861624 -0.0108129 -0.1453721 -0.0121518 -0.0302834 -0.0348946 -0.0453162 0.0923861 0.0333934 -0.0123606 0.0411231 -0.1483121 0.0399456 -0.0433888 -0.1006154 -0.019429 -0.1463835 -0.1435769 0.0413427 0.012652 0.0801174 0.0630236 -0.0195844 0.0436113 -0.0256387 0.0945706 0.0900207 0.0440138 -0.0024786 0.0356824 -0.0478911 -0.0035555 -0.0012127 -0.0008346 0.1701617 0.0745654 0.0519349 0.0003358 0.0449142 -0.0412179 -0.0031306 -0.0040108 -0.0004507 0.1653904 0.0419767 -0.0770882 -0.0061797 -0.0497461 0.050536 -0.0048138 0.0023152 -0.0117769 0.1646343 -0.0483027 0.0574617 -0.0016907 0.0914572 -0.1717658 -0.012095 -0.0006389 -0.0126951 0.1881456 0.2132827 -0.0897486 -0.0058919 -0.0065599 -0.1250573 -0.019725 -0.0027366 -0.0206925 0.3739838 unknown
polarizability: 218.675896|-3.2994877|109.6479443|3.4407034|0.6608171|54.3475561 unknown
InChI: InChI=1S/C9H9NO3/c11-10-6-7-1-2-8-9(5-7)13-4-3-12-8/h1-2,5-6,11H,3-4H2
charge 0 multiplicity 1
22 atoms
O  -2.02812 -1.608062 -0.026835
O  -2.652701 1.257171 -0.016848
O  5.086671 -0.334492 0.11007
N  3.781451 0.264935 0.112174
C  -1.020551 -0.6142 0.004086
C  -1.326441 0.774764 0.024438
C  -3.364044 -1.081423 0.330637
C  -3.633178 0.2245 -0.422596
C  0.320327 -1.037524 0.013246
C  -0.279778 1.722239 0.087176
C  1.375141 -0.089381 0.059167
C  1.058636 1.301266 0.106999
C  2.761018 -0.573207 0.063288
H  -3.408608 -0.912356 1.423993
H  -4.078756 -1.869168 0.044045
H  -3.556889 0.06344 -1.515121
H  -4.62161 0.641704 -0.172861
H  0.523763 -2.114061 -0.006913
H  -0.543668 2.784113 0.108416
H  1.87419 2.028381 0.150553
H  2.907993 -1.673862 0.023297
H  5.021555 -1.341175 0.069987
