program: Gaussian 09
title: 000024181
version: EM64L-G09RevD.01
frameworkgroup: C1[X(C7H8O5S)]
method: RPBEPBE
basis: SDD
operation: Freq
keyword: #pfreq=noraman
keyword: PBEPBE/SDD
title: #p freq=noraman PBEPBE/SDD
converged: YES YES NO NO
title: Mulliken charges:
elementType: S O O O O O C C C C C C C H H H H H H H H
charge: 0.990119 -0.267091 -0.453669 -0.568329 -0.510610 -0.504050 -0.045180 -0.380432 -0.236090 0.215280 0.250151 -0.294303 -0.495972 0.279058 0.282670 0.269625 0.373730 0.380931 0.252501 0.234059 0.227603
chargesum: 0.00000
title: Mulliken charges with hydrogens summed into heavy atoms:
elementType: S O O O O O C C C C C C C
charge: 0.990119 -0.267091 -0.079939 -0.187399 -0.510610 -0.504050 -0.045180 -0.101374 0.046580 0.215280 0.250151 -0.024678 0.218191
polarizability: 1.84654864e+02 1.52306000e+00 1.18733546e+02 6.01306082e-01 2.40567766e-01 7.10095036e+01
1716.lowfreq: -12.7622 -7.6477 -0.0316 -0.0013 0.0012 0.0015 27.1682 31.1371 76.7389
frequency: 27.0706 30.9174 76.7351 114.6336 131.8064 162.8563 171.8687 209.8228 226.0796 245.7778 276.9808 300.8885 321.5359 327.0663 348.5532 378.2145 406.6862 456.2885 467.4578 531.4693 560.5455 585.8020 625.2288 704.9830 723.0498 821.7492 822.4942 851.5096 856.2642 952.9844 960.1396 964.6436 1046.6501 1067.9949 1083.1122 1109.3480 1142.7206 1153.3146 1220.8867 1263.5456 1276.9143 1396.0080 1413.2441 1441.9892 1457.2762 1462.8476 1487.0728 1586.2646 1604.4112 3003.5468 3114.5909 3128.8632 3140.0766 3167.3975 3185.2296 3477.8575 3584.0769
redmass: 3.8909 4.2272 4.4196 7.1581 1.8359 1.6186 2.3782 4.5739 6.1742 3.5710 3.2990 3.8053 2.1458 2.6482 6.5760 6.1121 8.8574 3.3138 5.7706 10.6202 6.3369 5.6376 5.9508 5.2102 3.5771 1.4638 10.6630 4.0998 1.7547 1.3787 7.8765 13.5846 1.1838 2.0639 2.1495 1.2405 1.2239 1.3040 2.0651 3.2332 1.3860 4.2176 4.7957 1.2880 1.0547 1.0572 2.7813 6.4739 7.7228 1.0304 1.1026 1.0922 1.1060 1.0885 1.0977 1.0661 1.0662
irintensity: 4.1112 2.6902 3.2605 1.6902 0.8766 52.5198 8.3259 14.1437 0.7097 8.4822 60.6480 50.0448 61.8468 32.0735 13.0180 4.8421 84.0319 5.4342 20.0833 160.4975 7.2400 37.0320 38.2265 2.8619 3.6745 28.9126 73.7843 41.8267 44.5104 3.7500 26.5886 104.2997 78.1530 62.4319 88.4637 0.8272 104.0920 6.1736 90.3269 285.4088 28.3903 40.4720 25.4045 6.6277 17.9998 44.6745 115.7105 91.5004 13.3761 64.6010 31.9501 8.3262 16.9323 1.1180 3.0940 40.5826 50.1861
temp: 298.150 k
press: 1.00000 atm
elementType: 16 8 8 8 8 8 6 6 6 6 6 6 6 1 1 1 1 1 1 1 1
symmnumber: 1
zpe: 374774.1 jmol-1
zpe.correction: 0.142744 hartree
zpe.thermalcorrener: 0.156992 hartree
zpe.thermalcorrenthalpy: 0.157936 hartree
zpe.thermalcorrgfe: 0.100622 hartree
zpe.sumelectzpe: -1044.536381 hartree
zpe.sumelectthermal: -1044.522133 hartree
zpe.sumelectthermalent: -1044.521189 hartree
zpe.sumelectthermalfe: -1044.578502 hartree
dipole: 4.5144 1.3877 1.8732
dipole: 5.0808
quadrupole: -80.5370 -77.7154 -87.5923
quadrupole: 5.3012 -6.0620 -0.3110
quadrupole: 1.4112 4.2328 -5.6441 5.3012 -6.0620 -0.3110
hfenergy: -1044.6791244 hartree
pointgroup: C01 [X(C7H8O5S1)]
dipole: -1.8651244 -0.6262116 0.3534025 debye
dipolederiv: 2.2276803 -0.13404 0.1431247 -0.2327026 1.2527394 -0.1108294 0.3222411 -0.1200787 1.6745661 -1.9736964 0.0207854 -0.102925 0.1892566 -0.2769852 0.0176929 -0.2435981 0.0458695 -0.3193977 -0.5713642 -0.5183702 -0.1783169 -0.6428263 -0.8337359 -0.2322723 -0.1937925 -0.205209 -0.4747881 -0.5180295 0.0407234 -0.181589 0.0740129 -0.578043 0.1043179 -0.3228079 0.1247156 -1.0381119 -0.7047974 0.0614231 -0.0144347 0.15656 -0.6050306 -0.1163163 0.000763 -0.0454693 -0.5415701 -0.7735527 -0.0522963 0.0037892 -0.0988075 -0.5769562 0.0914365 -0.057315 0.015843 -0.496124 -0.4916348 0.0822555 -0.0015046 -0.0633576 -0.0625192 0.0111267 0.1482369 0.0082803 -0.1311392 0.0075241 -0.251796 -0.062728 0.3333536 -0.1335298 0.0453505 0.0641416 -0.0273007 -0.1175572 -0.0137047 0.0023747 0.0024492 -0.2476286 0.0009992 -0.0042195 -0.0786842 0.0126612 -0.1145294 1.6949232 -0.1707635 0.1248043 -0.6855279 -0.0120859 -0.0580829 0.136013 -0.0396625 0.1074092 0.1225419 0.5565176 0.1932383 0.9422369 0.6437465 0.3093541 0.2007179 0.2695157 0.148381 -0.373439 0.0032709 -0.0073293 -0.163865 0.0811556 0.0354745 -0.0214995 0.0485329 -0.1348329 0.9217082 0.0824364 0.0124632 0.4236211 0.2740474 0.0016492 0.0428455 -0.0258166 0.3031958 0.1443477 0.0234785 0.0112439 -0.0124796 0.0271692 -0.0404888 0.0053161 -0.0443648 0.1585975 0.0885017 -0.0631332 -0.0178389 -0.0325431 0.0897725 -0.0262468 -0.0190872 -0.0146202 0.1566493 0.043296 0.0595578 -0.002742 0.048214 0.0135548 -0.0337709 0.0102665 -0.0356932 0.1639365 0.1819752 0.1798614 0.0288141 0.1604724 0.2969933 -0.0037423 0.0195382 0.0006958 0.3871369 0.0822944 0.0031858 0.0782741 0.0247427 0.3453352 0.0075823 -0.0485043 0.0246055 0.2695988 0.0426881 -0.0100577 0.0195061 -0.1464396 0.0312763 -0.0856226 -0.0218847 -0.0858382 -0.0487349 -0.1334374 0.0685817 0.0073264 0.1206701 0.0159643 -0.0078554 0.0286953 -0.0099091 0.1198037 -0.0038248 0.0160048 -0.055625 -0.1469627 0.0061322 0.0954627 0.0283984 0.1032428 -0.0724894 unknown
polarizability: 182.9238265|-3.0287698|115.9049551|13.7375975|10.9848288|75.5691316 unknown
InChI: InChI=1S/C7H8O5S/c1-12-7-3-2-5(4-6(7)8)13(9,10)11/h2-4,8-9H,1H3
charge 0 multiplicity 1
21 atoms
S  2.751532 -0.172901 0.09785
O  -3.13399 1.067327 -0.369422
O  -2.171277 -1.645564 -0.965676
O  2.765577 -0.508285 1.931279
O  3.097268 -1.552674 -0.677088
O  3.625664 1.16339 -0.166518
C  0.935412 0.181333 -0.039098
C  0.097745 -0.880758 -0.412203
C  0.472619 1.481693 0.215252
C  -1.808051 0.667323 -0.270375
C  -1.284713 -0.637525 -0.546611
C  -0.910645 1.704984 0.092767
C  -4.252679 0.100439 -0.317922
H  0.527698 -1.868063 -0.622861
H  1.16113 2.285656 0.488132
H  -1.340402 2.692365 0.282335
H  -1.686201 -2.49017 -1.138512
H  3.723147 -0.617646 2.204517
H  -4.281678 -0.521381 -1.224852
H  -5.148184 0.735761 -0.247434
H  -4.170174 -0.545902 0.572939
