program: Gaussian 09
title: 000283996
version: EM64L-G09RevD.01
frameworkgroup: C1[X(C9H22N2O6S4)]
method: RPBEPBE
basis: SDD
operation: Freq
keyword: #p
keyword: freq=noraman
keyword: PBEPBE/SDD
title: #p freq=noraman PBEPBE/SDD
converged: YES YES NO NO
title: Mulliken charges:
elementType: S S S S O O O O O O N N C C C C C C C C C H H H H H H H H H H H H H H H H H H H H H H
charge: 0.076617 0.087418 0.998138 0.988271 -0.581707 -0.620858 -0.466508 -0.583207 -0.508310 -0.552798 -0.277198 -0.317952 -0.394000 -0.384851 -0.375683 -0.402884 -0.353019 -0.350846 -0.358174 -0.699417 -0.731468 0.212878 0.224292 0.226089 0.245929 0.199924 0.263547 0.241886 0.223521 0.217481 0.233287 0.306373 0.264288 0.237125 0.224313 0.210284 0.230859 0.325895 0.286542 0.296385 0.324983 0.399169 0.413384
chargesum: 0.00000
title: Mulliken charges with hydrogens summed into heavy atoms:
elementType: S S S S O O O O O O N N C C C C C C C C C
charge: 0.076617 0.087418 0.998138 0.988271 -0.182538 -0.207474 -0.466508 -0.583207 -0.508310 -0.552798 0.029175 -0.053664 0.043170 0.087167 0.087788 0.062524 0.097750 0.110593 0.082969 -0.086980 -0.110100
polarizability: 4.62754470e+02 6.11184602e+01 3.82923566e+02 1.63021072e+00 1.23748364e+00 1.71437106e+02
1716.lowfreq: -10.1400 -6.5535 -0.0007 0.0007 0.0020 3.3440 22.7707 27.5126 34.8977
frequency: 22.0967 27.4527 34.8069 41.6984 58.5244 59.8961 67.1797 75.5823 80.9749 96.4002 102.5299 115.2459 121.5150 124.4136 137.2403 142.0885 148.8050 157.9611 165.1880 173.0729 196.6318 206.9020 217.7178 229.7992 237.3042 261.3164 266.7890 275.3304 308.9103 313.2178 325.6388 341.0425 358.6607 384.5044 398.9041 403.5594 412.1533 477.5225 508.9789 511.1913 531.2400 551.5548 577.2166 606.8911 619.7909 691.1832 704.8049 768.6321 784.8485 809.0783 811.5190 824.6802 871.8318 881.0312 888.9672 906.8671 911.2529 917.4880 921.6667 997.7366 1004.0945 1005.6551 1020.5900 1046.1753 1061.3553 1080.0262 1089.6167 1098.4699 1130.4492 1145.2653 1159.8198 1170.8235 1184.9941 1195.5388 1216.1299 1234.9384 1244.3492 1259.2386 1273.2818 1277.1564 1288.2441 1291.7183 1297.0423 1302.9951 1318.2146 1336.0359 1338.7677 1346.5410 1357.2417 1392.1444 1421.8692 1442.8805 1450.7366 1453.6390 1455.3160 1460.9244 1463.7001 1471.5139 1474.0936 1478.9855 1501.5740 2084.6006 2867.0661 2903.8496 2920.4997 2946.6974 2961.5933 2969.5212 2979.7644 2994.9515 3007.8685 3017.8131 3019.2770 3025.4798 3044.1641 3051.1212 3064.0736 3066.7112 3067.6315 3103.4700 3114.8933 3461.5387 3514.9076
redmass: 7.0983 7.4733 8.1939 10.5235 6.0374 5.3823 4.4272 8.0178 7.0272 4.6014 3.7937 3.4473 9.7717 5.0937 5.3401 3.4803 5.2442 7.3170 4.9558 4.9764 3.0338 11.0165 2.8611 4.0450 5.8624 2.8250 7.0923 3.0554 7.8943 2.0754 8.2612 7.5299 2.4794 1.8516 3.1812 7.4686 9.5718 2.1639 4.3952 2.7589 2.3266 1.4737 1.2997 4.4715 4.8304 3.6028 11.7759 1.5900 1.5512 8.2580 1.4303 2.3051 2.6212 2.3936 1.7148 11.6053 1.7100 1.8511 7.7871 1.9926 1.4938 1.4578 3.2008 1.9090 2.3579 1.6994 2.4794 1.7080 1.7988 1.9222 1.2027 1.6409 1.5348 1.0993 1.2509 1.4230 1.2304 1.1629 1.2085 1.1842 1.1631 1.1802 1.0991 1.1493 1.2591 1.2537 1.4489 1.3274 1.2704 1.3127 1.0683 1.1532 1.1531 1.0842 1.0814 1.1644 1.0938 1.1879 1.0869 1.0842 1.0758 1.0930 1.0705 1.0690 1.0675 1.0630 1.0620 1.0666 1.0628 1.0645 1.0600 1.0932 1.0898 1.0869 1.0995 1.0961 1.0996 1.1030 1.0921 1.0682 1.1071 1.0753 1.0757
irintensity: 0.6892 0.1108 0.3232 1.7100 0.4994 0.6747 0.4031 0.5633 1.9956 6.8848 2.7194 5.2318 3.6176 12.3691 5.0028 12.0248 1.4756 40.0620 7.8814 8.1214 15.5270 20.9503 2.5637 18.5846 11.7226 6.5713 4.3128 11.3958 33.5303 33.5029 7.8659 121.7725 17.2909 60.7481 25.1382 14.2370 104.6460 22.0020 63.3263 55.1303 65.1237 172.0316 62.1076 3.3466 59.9872 4.6591 196.6678 5.7470 7.1913 15.7570 22.5492 5.2694 9.7788 5.8761 48.3755 51.3115 4.1886 10.0913 222.3340 62.6365 70.0609 159.6644 19.8388 5.6528 4.2697 2.1954 5.0019 1.1655 37.1442 24.2374 9.5390 6.9336 11.8785 93.8707 66.2854 30.0008 7.0418 2.3883 3.8688 22.3053 11.4152 44.4037 68.3557 23.1679 11.0884 2.4194 5.6045 10.4565 14.2713 47.8519 21.0665 22.2126 24.1433 5.1118 17.6353 6.4527 11.5897 1.6879 10.3697 15.4502 24.2466 1115.2720 84.8444 120.5129 9.5781 7.4909 19.7599 47.7637 69.7327 22.5494 5.5655 34.9100 14.5254 31.4284 3.3730 21.6678 26.6015 21.8963 13.6905 360.5608 6.8711 14.4279 49.5031
temp: 298.150 k
press: 1.00000 atm
elementType: 16 16 16 16 8 8 8 8 8 8 7 7 6 6 6 6 6 6 6 6 6 1 1 1 1 1 1 1 1 1 1 1 1 1 1 1 1 1 1 1 1 1 1
symmnumber: 1
zpe: 852917.5 jmol-1
zpe.correction: 0.324859 hartree
zpe.thermalcorrener: 0.352962 hartree
zpe.thermalcorrenthalpy: 0.353906 hartree
zpe.thermalcorrgfe: 0.264011 hartree
zpe.sumelectzpe: -2507.157342 hartree
zpe.sumelectthermal: -2507.129240 hartree
zpe.sumelectthermalent: -2507.128295 hartree
zpe.sumelectthermalfe: -2507.218191 hartree
dipole: 8.8992 8.4067 -1.3282
dipole: 12.3139
quadrupole: -156.0194 -151.7323 -164.5544
quadrupole: -15.7414 -0.8834 -0.7348
quadrupole: 1.4159 5.7031 -7.1190 -15.7414 -0.8834 -0.7348
hfenergy: -2507.4822014 hartree
pointgroup: C01 [X(C9H22N2O6S4)]
dipole: -4.3621728 2.0850775 0.3077056 debye
polarizability: 488.6107963|-31.9079313|325.6642853|-30.159532|-62.6294432|202.8400604 unknown
InChI: InChI=1S/C9H20N2S2.2HO3S/c12-8-2-6-10-4-1-5-11-7-3-9-13;2*1-4(2)3/h10-11H,1-9H2;2*1H
charge 0 multiplicity 1
43 atoms
S  3.647058 2.171338 -0.384484
S  -1.148718 -3.030695 2.130785
S  4.166285 -0.319282 -0.249628
S  -0.11095 -1.548683 0.414717
O  3.120567 -0.878529 -1.677392
O  1.513592 -2.25964 0.142857
O  5.703895 -0.680321 -0.54008
O  3.497372 -1.084306 1.079615
O  -0.928945 -1.715249 -0.97486
O  0.130473 -0.026285 0.955987
N  -1.138429 3.056792 -1.042321
N  -3.671995 -0.108486 0.854345
C  -2.920378 1.290168 -1.084423
C  -1.549808 1.761897 -1.61566
C  -2.948322 1.116722 0.46074
C  -0.008812 3.7931 -1.569116
C  -3.533673 -0.590711 2.239553
C  1.387641 3.559075 -0.858894
C  -3.841215 -2.099693 2.316476
C  1.85945 2.088517 -0.944972
C  -2.885043 -2.916138 1.425013
H  -3.71403 1.983274 -1.422005
H  -3.108362 0.298885 -1.536667
H  -1.597035 1.878179 -2.715941
H  -0.810928 0.960021 -1.404444
H  -3.381392 2.02934 0.939867
H  -1.915776 1.002231 0.839422
H  -0.199435 4.88242 -1.477869
H  0.093567 3.5578 -2.644006
H  -4.181637 -0.039196 2.960427
H  -2.486263 -0.419751 2.556253
H  -1.342315 3.1952 -0.048131
H  -4.628446 -0.170952 0.483327
H  1.320907 3.870614 0.200501
H  2.107467 4.238865 -1.361957
H  -4.878156 -2.29056 1.966851
H  -3.792012 -2.437464 3.368267
H  1.285061 1.444599 -0.256902
H  1.829007 1.694662 -1.971912
H  -3.217267 -3.95397 1.254234
H  -2.802076 -2.413889 0.433325
H  2.46432 -1.571907 -1.313113
H  2.280954 -1.782792 0.748314
