program: Gaussian 09
title: 000283832
version: EM64L-G09RevD.01
frameworkgroup: C1[X(C16H12ClN)]
method: RPBEPBE
basis: SDD
operation: Freq
keyword: #p
keyword: freq=noraman
keyword: PBEPBE/SDD
title: #p freq=noraman PBEPBE/SDD
converged: YES YES NO NO
title: Mulliken charges:
elementType: Cl N C C C C C C C C C C C C C C C C H H H H H H H H H H H H
charge: -0.027696 -0.023964 0.276355 0.012198 0.364681 0.053849 -0.304135 -0.296357 0.343801 -0.281003 -0.453110 -0.244529 -0.832707 -0.364832 -0.374588 -0.229536 -0.247078 -0.237920 0.251236 0.223413 0.237890 0.255291 0.237834 0.234861 0.234871 0.293544 0.213980 0.228760 0.225301 0.229590
chargesum: 0.00000
title: Mulliken charges with hydrogens summed into heavy atoms:
elementType: Cl N C C C C C C C C C C C C C C C C
charge: -0.027696 -0.023964 0.276355 0.012198 0.364681 0.053849 -0.052899 -0.072944 0.343801 -0.281003 -0.215219 0.010762 -0.125141 -0.071288 -0.160608 -0.000776 -0.021776 -0.008330
polarizability: 3.34921120e+02 2.62191161e+00 2.12417627e+02 -5.56623284e-02 1.69290213e-01 7.50221409e+01
1716.lowfreq: -2.7103 0.0020 0.0021 0.0021 5.1400 8.1118 24.3038 48.1399 90.6290
frequency: 23.8095 48.1030 90.6279 103.3273 129.6667 172.0295 178.1931 192.9159 232.8402 273.2750 311.9963 332.0477 360.4341 401.9232 404.0552 417.9751 465.2728 494.2017 531.9028 542.0284 557.8682 596.1128 614.9588 633.5517 688.9913 689.0899 696.8710 704.4208 778.6005 810.3049 829.0520 843.6537 844.0738 857.3980 924.5672 939.3192 943.0725 969.9913 979.2696 988.6312 988.7689 1015.6542 1016.8464 1034.7345 1046.0855 1073.2246 1087.0544 1129.7725 1168.7384 1173.4503 1197.0723 1206.0771 1251.9151 1286.5615 1296.4876 1321.5725 1334.4634 1375.5006 1385.6154 1400.6027 1407.4505 1422.7226 1445.3256 1472.1094 1478.6027 1482.2686 1515.3530 1544.8285 1585.9214 1598.3609 1602.8320 1614.5629 2975.3948 3050.1491 3090.1348 3124.9610 3134.7835 3137.1849 3145.1003 3148.9166 3159.5067 3169.1839 3169.3870 3174.8927
redmass: 3.8029 4.8948 7.1452 5.0326 3.9023 2.5532 1.3111 7.8582 4.2911 4.3723 4.5777 4.4864 10.2863 2.8213 4.5488 3.9439 3.4341 6.3128 3.9230 3.2614 7.7724 3.9319 6.5210 7.4182 6.2166 2.9757 1.8458 7.1457 1.8622 3.8292 1.4483 1.6710 5.8485 1.2930 3.5104 1.4621 1.3672 2.9288 1.3536 1.3517 6.0536 1.3429 2.9902 2.0027 1.5462 2.4004 1.7090 1.8286 1.3026 1.1100 1.2756 1.7460 1.8458 2.6206 2.7604 1.6397 4.6166 3.4625 6.0433 1.2723 3.8605 3.0640 2.7333 1.0459 1.9366 1.2819 3.3383 7.8501 6.3010 6.4556 6.2823 6.3805 1.0380 1.0974 1.0978 1.0846 1.0882 1.0898 1.0895 1.0916 1.0964 1.0953 1.0994 1.0957
irintensity: 0.1938 0.5690 1.0781 1.2414 2.7403 1.4278 1.7647 0.6205 0.3134 1.0371 0.0429 0.4101 4.1745 0.0757 0.4235 1.8710 3.2835 0.1483 6.2143 4.4745 3.3053 0.8375 2.0685 20.1584 4.8481 4.8300 43.7999 0.9562 84.0934 0.3767 16.3022 40.9848 9.9544 4.3914 19.7393 3.5690 0.0017 24.6031 0.0001 0.2330 0.2680 1.0620 11.5273 6.4958 5.9930 2.0955 13.7603 4.6553 1.3756 3.3686 15.5453 14.5978 7.1548 24.0681 34.3580 3.5434 1.2829 42.0999 12.1786 11.5070 36.2704 13.3593 32.1562 15.2184 10.8495 21.7408 26.5814 31.1436 11.8603 64.2288 10.5089 2.6965 34.3861 18.8672 19.8483 2.2410 8.3954 15.1069 24.2191 10.1153 16.4258 6.1755 29.5988 21.8271
temp: 298.150 k
press: 1.00000 atm
elementType: 17 7 6 6 6 6 6 6 6 6 6 6 6 6 6 6 6 6 1 1 1 1 1 1 1 1 1 1 1 1
symmnumber: 1
zpe: 604332.8 jmol-1
zpe.correction: 0.230178 hartree
zpe.thermalcorrener: 0.244803 hartree
zpe.thermalcorrenthalpy: 0.245747 hartree
zpe.thermalcorrgfe: 0.187379 hartree
zpe.sumelectzpe: -1130.502763 hartree
zpe.sumelectthermal: -1130.488138 hartree
zpe.sumelectthermalent: -1130.487194 hartree
zpe.sumelectthermalfe: -1130.545562 hartree
dipole: -1.2456 -3.7935 0.0041
dipole: 3.9928
quadrupole: -87.5410 -101.6110 -117.8340
quadrupole: 3.1749 -0.0177 0.0573
quadrupole: 14.7877 0.7176 -15.5053 3.1749 -0.0177 0.0573
hfenergy: -1130.7329407 hartree
pointgroup: C01 [X(C16H12Cl1N1)]
dipole: 0.5450997 1.3573369 0.5728682 debye
polarizability: 334.4267089|2.8712821|190.2186731|-11.4133248|50.427348|97.7155054 unknown
InChI: InChI=1S/C16H12ClN/c1-11-7-9-14(17)16-13(11)8-10-15(18-16)12-5-3-2-4-6-12/h2-10H,1H3
charge 0 multiplicity 1
30 atoms
Cl 1.348762 -2.992077 -1.533361
N  -0.047818 -0.556122 -0.386628
C  1.996985 0.770636 0.098022
C  1.320592 -0.419106 -0.393825
C  3.434144 0.872775 0.072258
C  -0.824952 0.44569 0.093384
C  1.145912 1.810481 0.599233
C  -0.237595 1.658837 0.60015
C  -2.300452 0.222287 0.066804
C  2.138642 -1.484478 -0.905008
C  4.165776 -0.205955 -0.440066
C  3.526596 -1.386173 -0.929904
C  4.141132 2.11405 0.585337
C  -2.80545 -1.007765 -0.440602
C  -3.226679 1.196374 0.531128
C  -4.191447 -1.254645 -0.481416
C  -4.615254 0.947814 0.489456
C  -5.105108 -0.278126 -0.016336
H  1.591657 2.732747 0.985113
H  -0.869625 2.462061 0.986633
H  5.259752 -0.152576 -0.470156
H  4.126415 -2.211606 -1.32421
H  5.234171 2.010617 0.484854
H  3.838208 3.019571 0.025944
H  3.919857 2.300421 1.653525
H  -2.082027 -1.747985 -0.79509
H  -2.879296 2.155894 0.92818
H  -4.562285 -2.207439 -0.875476
H  -5.314391 1.710076 0.851161
H  -6.18352 -0.469876 -0.047803
