program: Gaussian 09
title: 000283826
version: EM64L-G09RevD.01
frameworkgroup: C1[X(C16H9ClF3NO)]
method: RPBEPBE
basis: SDD
operation: Freq
keyword: #p
keyword: freq=noraman
keyword: PBEPBE/SDD
title: #p freq=noraman PBEPBE/SDD
converged: YES YES NO NO
title: Mulliken charges:
elementType: Cl F F F O N C C C C C C C C C C C C C C C C H H H H H H H H H
charge: -0.034964 -0.162476 -0.167414 -0.167653 -0.266091 -0.456363 0.190868 0.301396 0.166472 -0.456530 0.066344 -0.358974 0.344796 -0.347939 -0.421108 0.463230 0.239111 -0.400748 -0.359337 -0.223854 -0.236027 -0.113766 0.334046 0.269747 0.236461 0.210460 0.266021 0.232806 0.328681 0.261052 0.261752
chargesum: 0.00000
title: Mulliken charges with hydrogens summed into heavy atoms:
elementType: Cl F F F O N C C C C C C C C C C C C C C C C
charge: -0.034964 -0.162476 -0.167414 -0.167653 -0.266091 -0.122317 0.190868 0.301396 0.166472 -0.186783 0.066344 -0.122513 0.344796 -0.137479 -0.155087 0.463230 0.239111 -0.167942 -0.030656 0.037198 0.025725 -0.113766
polarizability: 4.63800206e+02 -1.16465684e+01 1.90149959e+02 -2.29585607e-02 -2.79794919e-02 7.87837629e+01
1716.lowfreq: -19.6546 -7.7791 -2.5761 0.0016 0.0018 0.0019 2.4953 24.2015 50.4914
frequency: -19.6513 24.1946 50.4851 64.2290 66.4812 101.2558 132.2418 151.0507 152.8922 197.3597 226.5732 281.0333 293.6245 300.6348 304.4044 315.6083 372.1831 381.2887 405.0098 425.8728 435.4230 445.4745 492.2256 500.2048 516.0425 517.7416 556.2262 605.6269 608.7948 626.3323 645.8186 656.1337 686.2096 714.5883 717.3906 744.5418 753.8980 775.9471 821.1542 828.8844 835.7570 857.9989 877.0506 903.4874 939.5205 952.2885 955.7540 969.3021 978.2563 997.9274 1007.1261 1021.8207 1048.5347 1074.9150 1115.5758 1133.5504 1165.9245 1193.0260 1205.4014 1211.0066 1261.4175 1292.0040 1302.0317 1312.5164 1333.7913 1351.3108 1397.2444 1408.7663 1423.0746 1470.0123 1478.9221 1496.1834 1556.7648 1583.8618 1597.1987 1613.6179 1640.1063 1646.4794 3072.3166 3127.8660 3129.4871 3143.8978 3160.5807 3169.3810 3174.6254 3180.7728 3591.2276
redmass: 13.0312 10.3423 3.9043 11.4272 10.0667 7.7890 10.0766 8.6080 11.5114 6.4405 10.1672 5.2544 12.3426 7.8667 7.5677 7.8840 3.6653 8.4830 4.3216 3.6228 9.0696 3.5830 6.1371 10.6393 2.8787 8.6286 5.5407 1.1974 11.4092 7.1156 4.8894 7.5822 7.5185 8.5404 3.9068 4.3679 5.9307 4.3358 1.3555 5.5848 1.5175 1.3272 1.5703 5.2017 1.4198 5.3146 1.4854 1.4956 6.7851 4.3524 5.0341 1.3149 4.0440 2.7581 1.6109 2.1662 3.5587 1.9007 1.2298 1.6088 2.3175 2.0250 3.0590 1.3910 2.0230 3.2422 4.4321 4.1231 1.9073 3.8688 2.6942 3.1459 7.1239 6.2046 7.4765 6.5279 7.8765 7.1574 1.0862 1.0899 1.0950 1.0901 1.0934 1.0942 1.0957 1.0948 1.0801
irintensity: 0.0094 0.3105 0.0330 0.5462 0.4761 2.8553 0.0891 0.0242 1.5294 0.1493 2.8440 1.9390 1.7755 9.5668 1.5321 17.5950 0.2612 0.0459 0.5652 0.4434 18.7723 0.1727 5.3479 5.6410 32.4508 19.0159 18.7959 98.9971 13.8245 2.1977 18.8711 0.4450 12.7502 0.6550 0.8442 5.5654 25.9004 1.1846 12.2792 16.0367 75.2351 38.1142 41.4861 89.1366 10.8913 6.7103 25.3816 2.1661 201.5133 68.2487 243.2123 4.6193 125.6819 99.3525 39.9720 33.4804 295.7280 18.3981 0.4518 248.3805 3.9930 201.0599 133.1640 5.7074 98.2371 8.2228 15.4602 10.5655 76.4228 63.6007 257.4566 10.3782 19.9206 220.0754 1.4738 85.9514 17.6419 361.9428 12.2710 7.3809 43.4585 6.6936 1.2492 5.4012 7.2704 0.8789 66.0431
temp: 298.150 k
press: 1.00000 atm
elementType: 17 9 9 9 8 7 6 6 6 6 6 6 6 6 6 6 6 6 6 6 6 6 1 1 1 1 1 1 1 1 1
symmnumber: 1
zpe: 551806.0 jmol-1
zpe.correction: 0.210172 hartree
zpe.thermalcorrener: 0.227412 hartree
zpe.thermalcorrenthalpy: 0.228356 hartree
zpe.thermalcorrgfe: 0.163781 hartree
zpe.sumelectzpe: -1503.176200 hartree
zpe.sumelectthermal: -1503.158960 hartree
zpe.sumelectthermalent: -1503.158015 hartree
zpe.sumelectthermalfe: -1503.222591 hartree
dipole: 1.7827 -1.6117 -0.0049
dipole: 2.4033
quadrupole: -166.8066 -118.5559 -137.8749
quadrupole: -11.5641 0.0261 -0.0124
quadrupole: -25.7275 22.5232 3.2042 -11.5641 0.0261 -0.0124
hfenergy: -1503.3863716 hartree
pointgroup: C01 [X(C16H9Cl1F3N1O1)]
dipole: -0.689586 -0.5723199 0.3015478 debye
polarizability: 463.2577868|16.0681987|166.0183019|-5.2922486|-46.3683046|103.4578398 unknown
InChI: InChI=1S/C16H9ClF3NO/c17-11-4-1-9(2-5-11)7-13-12-6-3-10(16(18,19)20)8-14(12)21-15(13)22/h1-8,21H
charge 0 multiplicity 1
31 atoms
Cl -7.603928 -0.475691 0.127136
F  5.786808 -1.4594 0.790264
F  5.863621 -0.288186 -1.152435
F  5.848944 0.809515 0.823976
O  -1.397254 2.276988 -1.290319
N  0.91286 1.881118 -1.05952
C  0.968583 -0.145774 0.023317
C  1.772606 0.902283 -0.529444
C  -0.450115 0.208904 -0.178649
C  3.171826 0.86998 -0.49937
C  -0.447355 1.542608 -0.890238
C  1.601039 -1.253177 0.621264
C  3.782358 -0.258503 0.109344
C  -1.503195 -0.587874 0.236283
C  3.012932 -1.308888 0.663859
C  -2.957351 -0.479777 0.166437
C  5.280902 -0.309688 0.14838
C  -3.705387 -1.561147 0.735031
C  -3.682366 0.607172 -0.417019
C  -5.110827 -1.57094 0.7290
C  -5.089881 0.605923 -0.427623
C  -5.786281 -0.479403 0.143542
H  1.19789 2.745909 -1.5181
H  3.7801 1.674891 -0.922848
H  1.01883 -2.072946 1.054693
H  -1.177168 -1.516142 0.733114
H  3.517205 -2.161991 1.124867
H  -3.172453 -2.405928 1.188282
H  -3.129857 1.443385 -0.857296
H  -5.671209 -2.401836 1.166208
H  -5.639377 1.439216 -0.874939
