program: Gaussian 09
title: 000283816
version: EM64L-G09RevD.01
frameworkgroup: C1[X(C12H11NO2)]
method: RPBEPBE
basis: SDD
operation: Freq
keyword: #p
keyword: freq=noraman
keyword: PBEPBE/SDD
title: #p freq=noraman PBEPBE/SDD
converged: YES YES NO NO
title: Mulliken charges:
elementType: O O N C C C C C C C C C C C C H H H H H H H H H H H
charge: -0.293101 -0.277895 -0.026956 0.267265 0.109179 -0.061069 -0.340414 -0.299120 -0.308851 -0.217235 0.203226 -0.185159 -0.370392 -0.257030 -0.665449 0.279650 0.312137 0.267394 0.236474 0.230878 0.222835 0.234911 0.242178 0.218356 0.251405 0.226782
chargesum: 0.00000
title: Mulliken charges with hydrogens summed into heavy atoms:
elementType: O O N C C C C C C C C C C C C
charge: -0.293101 -0.277895 -0.026956 0.267265 0.109179 -0.061069 -0.060764 0.013017 -0.041457 0.019240 0.203226 0.045719 -0.128214 0.200716 0.031093
polarizability: 2.03550301e+02 -1.24430393e+01 1.68785195e+02 5.72895316e+00 1.49144973e+00 6.74966092e+01
1716.lowfreq: -6.6128 -2.3882 -0.0007 -0.0003 0.0005 6.8291 25.8718 57.3903 79.4146
frequency: 25.6119 57.3655 79.3863 111.6521 151.0208 180.4223 210.3193 227.3791 270.8527 324.1199 366.7552 400.5054 428.6467 457.9473 469.6952 514.8119 533.0420 557.3355 631.0113 633.1087 725.6895 729.1665 763.7863 779.5174 808.8831 821.0295 827.6398 842.9352 869.0181 950.9610 952.9111 960.8163 1003.9774 1015.6736 1016.1938 1040.0251 1070.3503 1093.1468 1099.5169 1151.3879 1154.1719 1186.1665 1231.5823 1241.1953 1245.6254 1280.2666 1347.2446 1356.5295 1378.3082 1386.9964 1390.8708 1413.7150 1452.7758 1457.0380 1463.2622 1485.0843 1496.8701 1557.3561 1580.8719 1599.7242 1616.0612 2993.2927 3030.6037 3088.3256 3093.4054 3119.0887 3123.3418 3145.5380 3156.5539 3170.1115 3185.9484 3186.5670
redmass: 4.2474 3.6090 4.9137 4.8668 2.4456 4.0150 4.3138 1.3031 5.4903 3.0573 7.9104 4.2086 3.6193 5.5693 3.1864 3.9903 7.0861 6.7078 4.0806 6.4491 3.8926 4.2793 1.7932 2.8952 3.0989 1.9390 1.3239 2.7935 3.8930 4.7474 1.4197 1.4098 1.3618 1.3846 2.8771 2.7741 1.9857 2.4708 2.7041 1.2577 1.6624 1.5020 1.8001 2.3981 2.3489 1.1175 3.7210 1.2979 2.4796 1.9770 1.2377 3.4177 1.9364 1.2821 1.0447 1.0523 4.0854 7.0396 6.5561 6.6633 8.0643 1.0361 1.0591 1.0974 1.1035 1.1060 1.0895 1.0876 1.0933 1.0951 1.0958 1.0963
irintensity: 0.6572 0.4172 0.4574 6.5438 0.7136 2.1902 1.5738 3.3572 2.5665 21.4571 0.6751 0.6783 2.2866 4.0396 0.2534 13.5944 1.2111 6.2458 0.4046 1.0058 3.2784 13.1446 1.1712 10.3239 1.3966 0.2811 96.3893 16.5149 3.5788 53.9592 0.1281 0.0206 0.6778 7.4112 75.6060 49.6527 16.7595 176.6292 105.7201 10.0530 43.0780 61.7329 7.7210 76.5818 165.3969 1.1372 13.1461 3.7400 3.1650 3.4278 24.0806 1.5853 7.5526 14.0779 14.2184 13.0156 72.0097 18.4155 33.4556 65.8391 50.2015 21.9451 36.6403 38.9401 0.8946 30.9732 22.4990 6.7863 20.7132 8.9127 9.5521 12.8785
temp: 298.150 k
press: 1.00000 atm
elementType: 8 8 7 6 6 6 6 6 6 6 6 6 6 6 6 1 1 1 1 1 1 1 1 1 1 1
symmnumber: 1
zpe: 530951.2 jmol-1
zpe.correction: 0.202229 hartree
zpe.thermalcorrener: 0.215002 hartree
zpe.thermalcorrenthalpy: 0.215946 hartree
zpe.thermalcorrgfe: 0.161858 hartree
zpe.sumelectzpe: -668.025025 hartree
zpe.sumelectthermal: -668.012252 hartree
zpe.sumelectthermalent: -668.011307 hartree
zpe.sumelectthermalfe: -668.065395 hartree
dipole: -2.3366 0.5511 0.0425
dipole: 2.4011
quadrupole: -79.1252 -78.9214 -89.7581
quadrupole: -6.1088 0.0769 -0.2348
quadrupole: 3.4764 3.6801 -7.1565 -6.1088 0.0769 -0.2348
hfenergy: -668.2272533 hartree
pointgroup: C01 [X(C12H11N1O2)]
dipole: -0.8988579 0.2646231 0.1199452 debye
dipolederiv: -1.8710163 0.1495758 0.1404453 0.4661005 -0.4991453 -0.0309583 0.0795008 -0.0091701 -0.3364297 -0.8249322 -0.1484955 -0.0223644 -0.0353529 -0.8439994 -0.1411553 -0.0132518 -0.121066 -0.3482716 -0.3231143 -0.0287982 -0.0050594 0.0450773 -0.3329951 -0.0193359 0.0073223 -0.0194379 -0.2522161 0.0095653 -0.0845457 -0.0223321 -0.23047 -0.0962442 -0.0305751 -0.0501627 -0.0363108 0.0509989 -0.5734567 -0.1861682 -0.0361917 -0.3663313 -0.1483797 -0.0297486 -0.0903594 -0.02925 -0.0331995 0.0402293 -0.0456114 -0.0092124 -0.2410019 0.0553498 -0.0025816 -0.0530563 -0.0006898 0.0557277 0.1853537 -0.0304428 0.0028545 0.2810732 -0.062575 0.009618 0.0651335 0.0025681 -0.0935107 0.0148951 0.0459438 0.0160556 0.0317892 0.0771377 0.038909 0.0109108 0.041972 -0.1012113 0.1559988 0.0569821 0.0212414 -0.0397955 0.0791763 0.0441058 -0.0020652 0.0448982 -0.1104957 -0.377507 0.0856511 0.0172726 0.0763938 0.1629303 0.0704458 0.0113231 0.0742063 -0.1449085 2.2733168 0.0931422 -0.0093097 -0.2693331 1.0437264 0.2249056 -0.0047024 0.1749686 0.2799147 -0.2976782 0.1332641 0.0250592 -0.0000628 0.1207684 0.0509372 -0.004922 0.0538815 -0.0974383 0.461073 -0.1493681 -0.0202795 0.0338203 0.0837292 0.0327346 0.0215311 0.0272465 -0.052977 1.0369031 0.0072514 -0.0888081 0.194668 0.2592376 -0.0416315 0.0165017 -0.0661135 0.3253101 -0.1304112 -0.0044571 0.0524597 -0.0693563 0.0094276 0.0671071 0.019758 0.0956166 -0.0975467 0.0477937 0.0674879 0.0101407 0.0913143 0.0842103 -0.0164987 0.0173488 -0.0132394 0.1452622 0.157837 -0.0872956 -0.0228189 -0.040322 0.1017752 -0.0089106 -0.0103597 -0.0115881 0.1464264 -0.0034864 -0.0877633 -0.0227307 -0.0340223 0.0719348 -0.0188151 -0.0115525 -0.0202007 0.1486699 0.0787435 0.0061451 -0.0000633 -0.018056 -0.1071707 -0.0572582 -0.0051606 -0.0581747 0.1450184 0.0887932 0.0138658 0.0014981 0.0373079 -0.1051734 -0.0575874 0.0062166 -0.0572431 0.1445689 -0.0757795 0.0520583 -0.0209912 0.0877547 -0.05377 0.1001632 -0.0210844 0.0632409 0.0525542 -0.0000895 0.0175403 0.0484102 -0.1091754 0.021441 -0.1005615 -0.0100824 -0.055535 -0.0471584 -0.0926893 0.1118022 0.0197017 0.1008774 0.024562 -0.0205923 0.0165394 -0.0196838 0.1242059 -0.1880155 -0.0715064 -0.0079495 -0.0964271 0.100499 0.0032532 0.0146161 -0.0074949 0.0828211 0.0770186 0.1109397 -0.0483226 0.0987554 -0.0232185 0.0597052 -0.0266982 0.0268695 0.0623259 0.130655 -0.0271975 -0.0187056 0.0047745 -0.0232341 -0.1256746 0.0167552 -0.0802705 -0.0484406 unknown
polarizability: 201.8089808|-14.1221487|166.3495887|-4.5530181|20.9789448|71.6735358 unknown
InChI: InChI=1S/C12H11NO2/c1-2-15-12(14)10-5-3-7-11-9(10)6-4-8-13-11/h3-8H,2H2,1H3
charge 0 multiplicity 1
26 atoms
O  -2.732532 0.611973 0.045244
O  -1.897576 -1.518903 -0.357328
N  3.387868 -0.300159 0.02577
C  0.888995 -0.395966 -0.058683
C  -0.34804 0.349479 0.073661
C  2.143289 0.313833 0.128702
C  -0.300777 1.723343 0.376206
C  0.979768 -1.797593 -0.364985
C  2.141209 1.711835 0.434705
C  0.935862 2.405022 0.556249
C  -1.682435 -0.304359 -0.101564
C  2.235978 -2.399446 -0.464925
C  3.414166 -1.614591 -0.261836
C  -4.115632 0.06208 -0.088694
C  -4.607606 -0.507767 1.24485
H  -1.243298 2.26755 0.471415
H  0.060819 -2.367872 -0.513823
H  3.11268 2.19829 0.565737
H  0.933003 3.474387 0.790778
H  2.328601 -3.46515 -0.69719
H  -4.707197 0.93432 -0.410091
H  -4.111986 -0.710099 -0.87763
H  4.407338 -2.07388 -0.336975
H  -5.662498 -0.82512 1.146802
H  -4.010508 -1.386688 1.539709
H  -4.54869 0.250977 2.0442
