program: Gaussian 09
title: 000283818
version: EM64L-G09RevD.01
frameworkgroup: C1[X(C12H12N2O2)]
method: RPBEPBE
basis: SDD
operation: Freq
keyword: #p
keyword: freq=noraman
keyword: PBEPBE/SDD
title: #p freq=noraman PBEPBE/SDD
converged: YES YES NO NO
title: Mulliken charges:
elementType: O O N N C C C C C C C C C C C C H H H H H H H H H H H H
charge: -0.275338 -0.431501 -0.433931 -0.115414 0.159686 0.273060 -0.529271 0.363309 0.353921 -0.407126 0.129487 -0.358177 -0.457147 0.097252 -0.808392 -0.800395 0.290716 0.311985 0.227454 0.276591 0.251120 0.238400 0.239372 0.261419 0.282147 0.245763 0.245810 0.369201
chargesum: 0.00000
title: Mulliken charges with hydrogens summed into heavy atoms:
elementType: O O N N C C C C C C C C C C C C
charge: -0.275338 -0.062300 -0.121946 -0.115414 0.159686 0.273060 -0.238555 0.363309 0.353921 -0.179672 0.129487 -0.081587 -0.206028 0.097252 -0.069201 -0.026675
polarizability: 2.72339777e+02 8.15008163e+00 1.65907177e+02 -7.12766564e-03 -1.56197199e-03 6.87660885e+01
1716.lowfreq: 0.0006 0.0007 0.0008 4.3274 8.7215 14.1258 42.1571 54.8916 92.5390
frequency: 42.1468 54.8811 92.5096 116.2283 137.4719 150.9416 162.3604 191.7890 241.8794 253.6416 254.9374 321.8937 345.5643 351.7935 426.6392 428.9052 432.4057 487.6499 494.5526 510.9293 543.8701 577.8063 578.1387 583.0728 596.0091 650.7630 705.8850 711.3842 775.6052 809.3217 835.8274 860.8232 864.4175 905.7893 954.0641 975.2641 985.2242 986.0116 1007.4301 1038.0811 1049.2873 1072.3056 1100.7339 1146.0145 1179.3716 1238.7105 1253.8298 1271.4741 1286.3435 1340.7388 1358.4736 1385.0113 1395.1511 1403.5983 1423.0633 1456.4138 1464.0640 1468.3157 1480.7894 1487.1768 1499.6759 1547.3125 1574.0772 1597.7905 1618.0882 1644.3199 2976.6835 2993.9925 3051.1550 3070.2392 3116.6182 3117.6138 3135.2517 3157.4679 3169.7588 3177.1008 3544.5337 3572.2419
redmass: 4.2742 4.1290 1.0886 5.4000 5.4632 1.6179 1.7655 3.4458 6.3293 6.1404 3.7373 4.0432 3.4178 4.3951 1.6119 4.7161 2.4834 4.9391 6.8411 2.7018 6.6400 5.0526 3.7631 1.8589 1.6620 5.5285 3.6227 4.5510 3.1685 4.9343 1.5063 1.5311 5.4193 5.3270 1.4595 3.2208 2.3478 1.3443 1.6267 1.5880 1.5165 1.8282 3.7074 1.5540 1.6835 1.7322 1.6333 1.5943 2.2817 2.5471 2.3189 2.6172 1.5005 1.3313 4.8675 1.3818 1.0964 1.0438 1.0466 2.1755 4.1749 7.9072 4.5761 4.8573 6.5215 6.0751 1.0395 1.0390 1.0979 1.0972 1.0961 1.0905 1.0971 1.0907 1.0946 1.0926 1.0773 1.0673
irintensity: 0.5287 4.0432 0.0035 4.4389 0.0016 0.0103 0.0142 0.0197 0.1635 0.2492 0.6297 5.4666 23.6335 4.1116 75.7533 3.8068 45.9434 14.3390 12.1403 6.9456 0.2211 12.2634 4.2306 74.5478 11.9915 17.3128 8.2780 14.3988 0.3117 16.9453 48.6461 38.8624 40.2210 94.6639 13.7532 38.4502 61.8766 0.0632 4.0990 0.5069 9.3404 1.4972 4.7012 34.8613 2.5804 124.8246 10.9306 21.8727 5.3249 2.6507 7.1731 21.1410 53.5893 23.6340 2.0168 87.4465 16.3118 17.9990 21.0359 15.9353 190.4063 131.1887 16.6266 35.0295 60.3916 163.7830 29.7966 7.4587 16.5686 11.4164 7.3145 17.8453 8.5333 5.7587 4.2937 4.7301 44.7297 88.5714
temp: 298.150 k
press: 1.00000 atm
elementType: 8 8 7 7 6 6 6 6 6 6 6 6 6 6 6 6 1 1 1 1 1 1 1 1 1 1 1 1
symmnumber: 1
zpe: 569833.3 jmol-1
zpe.correction: 0.217038 hartree
zpe.thermalcorrener: 0.231736 hartree
zpe.thermalcorrenthalpy: 0.232680 hartree
zpe.thermalcorrgfe: 0.175348 hartree
zpe.sumelectzpe: -723.264707 hartree
zpe.sumelectthermal: -723.250010 hartree
zpe.sumelectthermalent: -723.249066 hartree
zpe.sumelectthermalfe: -723.306398 hartree
dipole: 2.3840 -6.1256 0.0028
dipole: 6.5732
quadrupole: -68.4489 -94.2859 -96.8565
quadrupole: -11.0713 0.0031 -0.0050
quadrupole: 18.0815 -7.7555 -10.3261 -11.0713 0.0031 -0.0050
hfenergy: -723.4817456 hartree
pointgroup: C01 [X(C12H12N2O2)]
dipole: 0.9124367 2.4143816 -0.1613411 debye
polarizability: 272.4331392|-7.2362003|165.4203762|-3.2388175|-5.6261264|69.1595265 unknown
InChI: InChI=1S/C12H12N2O2/c1-7-5-12(15)10-6-9(8(2)14-16)3-4-11(10)13-7/h3-6,13,16H,1-2H3
charge 0 multiplicity 1
28 atoms
O  1.492619 -2.7393 0.211537
O  -5.323798 0.36132 0.148265
N  2.467281 1.287321 -0.044634
N  -3.936892 0.82852 0.095162
C  0.745837 -0.432151 0.088024
C  1.110532 0.942758 0.000612
C  -0.627042 -0.777938 0.132591
C  -1.640634 0.202925 0.092852
C  3.486024 0.336483 -0.007264
C  0.099606 1.945551 -0.039891
C  1.792619 -1.496706 0.132359
C  -1.247993 1.580024 0.005338
C  3.171206 -1.009203 0.078272
C  -3.078356 -0.180266 0.141511
C  4.896676 0.875893 -0.067333
C  -3.470845 -1.638514 0.237942
H  -0.852071 -1.847143 0.199976
H  2.714935 2.276358 -0.108458
H  0.380205 3.004243 -0.106905
H  -2.030349 2.343599 -0.025243
H  3.972528 -1.75183 0.107523
H  5.104901 1.559745 0.777957
H  5.076019 1.434846 -1.005972
H  5.623459 0.051154 -0.021345
H  -4.564158 -1.746183 0.262716
H  -3.075277 -2.204122 -0.625325
H  -3.045977 -2.094437 1.150895
H  -5.828053 1.213454 0.103936
