program: Gaussian 09
title: 000283814
version: EM64L-G09RevD.01
frameworkgroup: C1[X(C14H17NO4)]
method: RPBEPBE
basis: SDD
operation: Freq
keyword: #p
keyword: freq=noraman
keyword: PBEPBE/SDD
title: #p freq=noraman PBEPBE/SDD
converged: YES YES NO NO
title: Mulliken charges:
elementType: O O O O N C C C C C C C C C C C C C C H H H H H H H H H H H H H H H H H
charge: -0.290151 -0.264710 -0.307780 -0.273569 -0.467464 0.473394 0.239505 -0.439373 -0.352865 -0.336637 -0.346579 0.399202 0.183193 -0.808697 -0.449736 -0.256480 -0.665716 0.229942 -0.500450 0.229658 0.273159 0.303088 0.271638 0.273427 0.206204 0.248604 0.303348 0.271326 0.220857 0.233653 0.216333 0.251604 0.227279 0.240440 0.241993 0.222360
chargesum: 0.00000
title: Mulliken charges with hydrogens summed into heavy atoms:
elementType: O O O O N C C C C C C C C C C C C C C
charge: -0.290151 -0.264710 -0.307780 -0.273569 -0.164376 0.473394 0.239505 -0.209715 -0.079706 -0.064999 -0.073152 0.399202 0.183193 -0.050541 -0.178410 0.198030 0.029500 0.229942 0.204343
polarizability: 3.34064320e+02 -1.13162235e+01 1.87757742e+02 2.46779810e+00 -6.59169413e+00 1.00567016e+02
1716.lowfreq: -6.7523 -2.0430 -0.0006 -0.0003 0.0006 5.4700 24.7982 29.8244 36.3288
frequency: 24.7838 29.7939 36.3132 54.0285 59.9092 70.9539 80.4636 90.4892 107.4239 121.8820 140.5198 148.9923 166.4926 208.9992 239.5635 244.1125 270.8174 304.0875 316.8498 331.4704 353.6809 404.0714 412.8579 462.2325 474.2881 500.0589 526.3553 555.1638 597.0150 630.7840 646.6699 674.7739 680.7119 719.1363 743.0550 754.8224 759.1735 814.0469 821.9503 834.5751 844.1535 850.8379 887.9248 904.2096 982.6303 991.6425 994.7284 997.9948 1009.3266 1029.5579 1051.7756 1063.0847 1095.2250 1111.3083 1125.8500 1143.0476 1154.6432 1186.0073 1218.8384 1246.7672 1255.6596 1279.8078 1291.0313 1312.2353 1328.2750 1357.7842 1385.6048 1389.5391 1403.7208 1422.3826 1429.2363 1448.4924 1449.0097 1455.4830 1461.6291 1466.7719 1482.0943 1485.2125 1503.2984 1511.5579 1583.3480 1588.2478 1614.5431 1621.5426 1654.3088 2975.1130 2992.3313 3000.6942 3028.2101 3049.5402 3087.3691 3092.1494 3101.3576 3117.8104 3119.4574 3138.5934 3149.8778 3162.9739 3165.6683 3171.7767 3188.4543 3515.8506
redmass: 4.3291 4.6016 4.4196 3.1486 2.1784 1.5634 4.1968 4.1212 1.7268 1.8358 4.1563 3.2898 3.6812 1.4420 3.1749 4.4192 4.6843 3.9414 3.2156 4.6038 3.7283 4.5069 2.9802 3.9548 6.0143 3.1703 2.3928 4.0154 1.3895 6.8986 4.9641 4.4616 5.5613 4.8512 3.7733 3.9678 4.9612 1.4927 2.5402 1.5264 2.9374 1.9642 1.3966 3.7472 1.3581 1.8011 3.1747 3.2928 2.5856 1.6070 1.5273 4.1987 2.1476 1.2607 1.3522 1.4260 1.6722 1.1746 3.2846 3.6464 3.2586 1.1164 1.4422 2.7283 1.5113 1.3031 3.0750 1.2344 1.2805 1.2673 3.4000 1.0848 1.0835 1.1019 1.0454 1.0546 1.0638 1.0531 2.2111 2.4186 5.5208 5.1954 8.5763 6.0610 5.3427 1.0417 1.0361 1.0292 1.0593 1.0968 1.0975 1.1034 1.1043 1.1057 1.0899 1.1047 1.0946 1.0949 1.0888 1.0890 1.0959 1.0753
irintensity: 0.1305 2.9530 2.2218 0.2691 1.5861 0.5883 1.6217 0.3501 2.3391 0.3758 3.5617 5.0547 0.9972 1.6154 1.8555 1.4393 4.0816 26.3995 14.7213 4.2279 5.5552 7.3018 1.0043 2.7901 4.9750 8.8198 68.9799 3.3771 95.6954 1.3938 3.5188 16.1126 24.3283 2.3800 11.6741 12.6866 30.0482 1.9105 0.7014 14.7666 29.3677 59.9003 9.1294 23.3526 2.0041 74.0908 106.5525 57.3733 34.2197 14.4139 16.2745 362.0089 26.4439 0.1571 24.2355 56.7008 68.7435 210.1858 18.6639 661.8334 266.2872 1.7315 20.8335 113.8916 15.1887 18.3155 46.2839 24.4214 40.4261 22.6328 17.7205 20.3761 46.2810 46.6630 14.8159 33.7826 26.1050 20.8078 7.5454 573.4339 16.5242 116.3505 532.7226 92.9672 387.6754 33.3743 23.7682 54.9292 40.3104 17.7487 43.0644 1.2138 28.8441 30.9080 12.7218 20.5765 1.2866 4.3012 6.8484 2.2128 1.1629 24.3347
temp: 298.150 k
press: 1.00000 atm
elementType: 8 8 8 8 7 6 6 6 6 6 6 6 6 6 6 6 6 6 6 1 1 1 1 1 1 1 1 1 1 1 1 1 1 1 1 1
symmnumber: 1
zpe: 750901.7 jmol-1
zpe.correction: 0.286003 hartree
zpe.thermalcorrener: 0.306165 hartree
zpe.thermalcorrenthalpy: 0.307109 hartree
zpe.thermalcorrgfe: 0.234430 hartree
zpe.sumelectzpe: -897.928868 hartree
zpe.sumelectthermal: -897.908707 hartree
zpe.sumelectthermalent: -897.907763 hartree
zpe.sumelectthermalfe: -897.980442 hartree
dipole: 1.6718 2.6280 1.5144
dipole: 3.4634
quadrupole: -98.6230 -106.5578 -114.4235
quadrupole: 22.4780 1.7163 -5.3190
quadrupole: 7.9118 -0.0230 -7.8887 22.4780 1.7163 -5.3190
hfenergy: -898.2148717 hartree
pointgroup: C01 [X(C14H17N1O4)]
dipole: -0.6449096 -0.9944121 0.6722331 debye
polarizability: 333.1670419|-13.3724731|188.543483|-11.4269327|2.9128796|100.6785531 unknown
InChI: InChI=1S/C14H17NO4/c1-4-19-14(17)11-5-7-12(8-6-11)15-10(2)9-13(16)18-3/h5-9,15H,4H2,1-3H3
charge 0 multiplicity 1
36 atoms
O  4.251125 1.216074 0.521992
O  4.8515 -0.885884 -0.305837
O  -5.219321 0.979677 0.535731
O  -3.984866 2.659086 -0.508859
N  -1.607654 -1.475812 0.296605
C  -0.259439 -1.047898 0.227202
C  2.509472 -0.382907 0.146421
C  0.704068 -1.994043 -0.23172
C  0.185513 0.234435 0.657887
C  2.066857 -1.666416 -0.269327
C  1.553459 0.555958 0.613084
C  -2.815388 -0.757235 0.319893
C  3.963765 -0.082671 0.083154
C  -3.981257 -1.624288 0.755434
C  -2.887103 0.574357 -0.045893
C  5.687323 1.624756 0.478779
C  6.061851 2.152592 -0.909192
C  -4.03129 1.485449 -0.045822
C  -6.35686 1.927049 0.536085
H  0.371518 -2.984071 -0.568339
H  -0.524593 0.961103 1.058199
H  -1.722839 -2.492457 0.308452
H  2.810065 -2.38718 -0.625223
H  1.89576 1.537427 0.952017
H  -3.93072 -2.617334 0.26658
H  -3.951083 -1.787135 1.849532
H  -4.938145 -1.147774 0.512601
H  -1.995101 1.062737 -0.446752
H  5.756943 2.406604 1.252155
H  6.308222 0.754911 0.756749
H  7.100212 2.533233 -0.895421
H  5.99941 1.34949 -1.662261
H  5.394977 2.979119 -1.209781
H  -6.627053 2.209164 -0.495695
H  -6.096515 2.8400 1.097888
H  -7.176715 1.381382 1.025883
