program: Gaussian 09
title: 000283782
version: EM64L-G09RevD.01
frameworkgroup: C1[X(C10H13NO)]
method: RPBEPBE
basis: SDD
operation: Freq
keyword: #p
keyword: freq=noraman
keyword: PBEPBE/SDD
title: #p freq=noraman PBEPBE/SDD
converged: YES YES NO NO
title: Mulliken charges:
elementType: O N C C C C C C C C C C H H H H H H H H H H H H H
charge: -0.426489 -0.076059 0.347604 0.397435 0.161591 0.492353 -0.625245 -0.626067 -0.854267 -0.809568 -0.814041 -0.348051 0.235955 0.236221 0.234633 0.234224 0.235013 0.242467 0.216352 0.242343 0.236614 0.226226 0.225094 0.251654 0.364009
chargesum: 0.00000
title: Mulliken charges with hydrogens summed into heavy atoms:
elementType: O N C C C C C C C C C C
charge: -0.062479 -0.076059 0.347604 0.397435 0.161591 0.492353 -0.389290 -0.389846 -0.150398 -0.108406 -0.126108 -0.096397
polarizability: 1.99020316e+02 3.78681474e+00 1.30156682e+02 5.10596301e-01 -4.38731192e-02 6.18996557e+01
1716.lowfreq: -23.9385 -7.6846 -5.2750 -3.3833 -0.0007 -0.0006 0.0003 59.8522 105.2436
frequency: -22.3529 59.8476 105.2350 150.3252 166.9692 188.7384 199.5261 221.3236 232.2821 275.0452 300.9955 340.7299 374.2600 400.8543 420.7289 504.1986 528.6375 533.3342 559.0865 574.7951 582.9977 753.1948 812.0731 868.1378 873.7215 897.3595 946.0286 960.0213 963.3105 1016.7286 1020.1528 1040.6988 1042.6725 1044.9170 1049.3846 1157.5825 1207.1820 1247.8354 1266.1595 1311.8721 1363.8072 1383.7955 1395.5496 1401.2393 1403.5175 1416.4856 1452.4246 1452.9387 1470.6796 1472.4927 1475.0965 1479.7070 1493.8432 1543.8416 1582.8660 1620.7722 2973.3618 2975.9543 2982.8069 3052.5263 3054.7607 3062.7701 3082.4801 3084.9693 3086.2306 3088.9546 3115.1373 3119.4423 3571.3291
redmass: 1.0183 3.8533 2.5669 4.8991 2.9407 1.5300 1.6373 1.8899 1.7036 2.5927 3.6808 3.9549 4.3534 3.1036 1.2064 3.3419 3.0606 5.1253 4.2420 3.0952 4.1706 3.3323 3.9937 1.2885 6.8135 1.3057 2.4681 1.4565 3.3999 1.6289 1.6798 1.5533 1.5503 1.7912 1.6412 2.3104 1.4643 1.3633 1.4509 6.2054 4.7800 1.5052 1.2275 1.2120 1.5682 1.8047 1.6451 1.0919 1.2356 1.0752 1.2644 1.0464 1.3572 5.9138 6.2746 5.9031 1.0389 1.0379 1.0363 1.0977 1.0944 1.0955 1.0940 1.0999 1.1007 1.0913 1.0910 1.0918 1.0674
irintensity: 0.4611 0.0595 0.1656 0.8857 5.9574 2.0425 0.0017 0.1656 0.1014 0.3173 2.8059 0.7709 2.3621 35.0596 132.0458 0.7362 0.1645 6.2730 0.9843 5.4627 11.2075 3.1661 84.8432 20.4626 129.9745 0.0947 13.1335 19.3425 0.0977 3.1184 1.1805 3.4734 0.2072 2.6969 29.8158 22.2227 53.3862 14.1053 1.7107 2.9671 3.2068 34.0260 13.5092 12.7256 10.8187 5.0302 1.1532 11.3375 1.2485 14.3365 39.6425 13.5061 18.2546 10.2607 14.4525 44.5926 39.2773 26.5565 19.5798 16.7617 23.9420 11.9672 17.6799 17.0145 24.4674 13.3834 31.6557 19.6380 75.7970
temp: 298.150 k
press: 1.00000 atm
elementType: 8 7 6 6 6 6 6 6 6 6 6 6 1 1 1 1 1 1 1 1 1 1 1 1 1
symmnumber: 1
zpe: 537474.5 jmol-1
zpe.correction: 0.204713 hartree
zpe.thermalcorrener: 0.216687 hartree
zpe.thermalcorrenthalpy: 0.217631 hartree
zpe.thermalcorrgfe: 0.167314 hartree
zpe.sumelectzpe: -517.902653 hartree
zpe.sumelectthermal: -517.890680 hartree
zpe.sumelectthermalent: -517.889736 hartree
zpe.sumelectthermalfe: -517.940052 hartree
dipole: 1.1113 0.0303 0.0737
dipole: 1.1141
quadrupole: -62.9431 -65.4323 -75.2973
quadrupole: 3.4913 0.2211 -0.0360
quadrupole: 4.9478 2.4586 -7.4064 3.4913 0.2211 -0.0360
hfenergy: -518.1073666 hartree
pointgroup: C01 [X(C10H13N1O1)]
dipole: -0.4334893 -0.0522692 0.0385935 debye
dipolederiv: -1.6447115 -0.0940733 0.0287474 0.6077616 -0.0303624 0.0084129 0.0724769 0.0273168 -0.3967644 0.8975501 0.1386948 -0.0189619 -0.6302717 -0.1791566 0.017521 -0.0688932 -0.0037959 -0.1740249 0.1850509 -0.1738594 -0.0183445 0.0157216 0.2677541 0.0231533 0.0033379 0.0284095 -0.0210448 0.177467 0.2121246 0.0079318 -0.0060984 0.2490844 0.0128758 0.0035432 0.008139 0.0085889 -0.1963754 0.0124816 0.0100528 0.1093635 -0.2351227 -0.0158938 0.0142275 -0.013071 -0.0580037 0.466625 -0.0056413 -0.0367135 -0.0191073 0.1459759 0.0108431 -0.1228542 0.0092726 0.0084079 -0.3095545 0.1993499 0.0153909 0.2538079 -0.0888304 -0.0069033 0.0270558 -0.0037201 -0.2063175 -0.3087562 -0.2222575 -0.0119254 -0.218061 -0.0760353 0.0222391 -0.0051024 0.0198498 -0.2008577 0.0059666 0.1249632 0.009231 0.0960634 -0.0775087 -0.0125475 0.0046648 -0.0143901 0.061716 -0.0007374 -0.2179939 -0.0141722 -0.1068899 -0.0885736 -0.0042871 -0.0104552 -0.0010607 0.0255608 -0.1768714 0.0041925 0.0231549 -0.0027532 0.0731249 0.0008016 0.1668308 0.0032289 0.0552086 0.440399 -0.0449586 -0.0176489 -0.250855 0.100219 0.0165542 -0.0319084 0.010865 -0.0450661 0.0138954 -0.0895872 -0.0048369 -0.1139295 -0.0770626 -0.0105421 -0.0102676 -0.0152287 0.1457148 0.0239085 0.0762438 0.0059505 0.109572 -0.0833412 -0.0194122 0.0048812 -0.0146039 0.142332 0.0272332 0.0652743 0.1123931 0.0191566 0.0395831 0.0097227 0.1041673 -0.0445448 -0.0476351 0.0144292 0.0828022 -0.1055037 0.0343414 0.0342009 -0.0002737 -0.1035375 0.050552 -0.0301581 -0.0368248 -0.1889537 -0.0091329 -0.0683708 -0.0348321 -0.0078588 -0.0007418 -0.0046742 0.1054132 0.0349746 -0.0474921 0.0913919 -0.0118762 0.0498671 -0.0080752 0.0877451 0.0332643 -0.0280948 -0.031058 0.19936 0.0161618 0.0716853 -0.0752794 -0.0132049 0.0083214 -0.0164024 0.1007178 0.0246011 -0.036424 -0.0996215 -0.0010537 0.051883 0.0174452 -0.0909833 -0.0210349 -0.0205968 -0.0470777 -0.0027349 0.0540445 -0.0021941 0.1086231 0.0133718 0.1102183 0.0119541 -0.1038295 0.0133149 0.0262403 -0.0150743 0.1159978 -0.0814062 0.0848853 -0.0755563 0.0685707 0.0757663 0.0021759 -0.0328098 -0.0264765 -0.1087802 -0.0485522 -0.1022255 -0.0973631 -0.0850214 0.0510968 0.0376468 0.0496908 0.0068546 0.0765498 -0.0486994 -0.0166652 0.0084564 -0.0157669 0.1705052 0.3867289 -0.0346324 -0.002893 0.03022 0.1044473 -0.0199369 0.0017366 -0.0181077 0.381365 unknown
polarizability: 197.7058147|9.9255035|131.0405429|-3.9285721|4.3842384|62.330296 unknown
InChI: InChI=1S/C10H13NO/c1-7-4-8(2)10(6-11-12)9(3)5-7/h4-6,12H,1-3H3
charge 0 multiplicity 1
25 atoms
O  4.158576 0.244731 -0.131759
N  2.791139 0.793033 -0.060498
C  -0.296799 -1.294375 -0.11859
C  -0.203936 1.180876 0.044708
C  0.47684 -0.081674 -0.057433
C  -2.39125 0.012258 0.029932
C  -1.705788 -1.222153 -0.075675
C  -1.617438 1.19524 0.083775
C  0.353709 -2.666997 -0.232995
C  0.532847 2.50309 0.109394
C  -3.90632 0.062177 0.107414
C  1.938441 -0.217329 -0.106014
H  -2.285314 -2.152488 -0.126324
H  -2.128797 2.163305 0.159089
H  0.964555 -2.765321 -1.150229
H  1.013647 -2.888881 0.626914
H  -0.418185 -3.453883 -0.266163
H  1.175143 2.65326 -0.777176
H  -0.181068 3.34173 0.181521
H  1.220322 2.541612 0.97368
H  -4.251492 0.000132 1.158239
H  -4.302591 1.003706 -0.311794
H  -4.368559 -0.778914 -0.438835
H  2.351181 -1.233953 -0.183664
H  4.718737 1.061821 -0.090312
