program: Gaussian 09
title: 000283808
version: EM64L-G09RevD.01
frameworkgroup: C1[X(C17H18O4S)]
method: RPBEPBE
basis: SDD
operation: Freq
keyword: #p
keyword: freq=noraman
keyword: PBEPBE/SDD
title: #p freq=noraman PBEPBE/SDD
converged: YES YES NO NO
title: Mulliken charges:
elementType: S O O O O C C C C C C C C C C C C C C C C C H H H H H H H H H H H H H H H H H H
charge: 1.041549 -0.364111 -0.476768 -0.547000 -0.479795 -0.495311 0.048750 -0.388236 -0.383343 0.396546 0.365174 -0.312854 -0.364465 -0.382745 -0.382786 -0.361125 -0.253649 -0.225999 -0.222963 -0.247882 -0.238881 -0.236375 0.295268 0.254700 0.264139 0.220155 0.214202 0.240675 0.229775 0.370448 0.228731 0.296396 0.275313 0.244328 0.230055 0.229712 0.227007 0.229261 0.230531 0.231571
chargesum: 0.00000
title: Mulliken charges with hydrogens summed into heavy atoms:
elementType: S O O O O C C C C C C C C C C C C C C C C C
charge: 1.041549 -0.364111 -0.106320 -0.547000 -0.479795 -0.200042 0.048750 0.130604 0.051014 0.396546 0.365174 0.157595 -0.135733 -0.086349 -0.107472 -0.116797 -0.023594 0.003713 0.004044 -0.018621 -0.008350 -0.004804
polarizability: 2.25971150e+02 -8.80396576e+00 2.43899690e+02 3.23419433e+00 -9.57002670e+00 1.85463610e+02
1716.lowfreq: -7.1133 -6.5591 -0.0010 -0.0009 -0.0007 5.8208 36.6500 40.9975 45.2846
frequency: 36.5723 40.9556 45.2026 59.0777 68.0630 76.7508 109.1911 143.6307 158.9006 178.9096 186.1105 214.8974 247.5606 253.7933 274.3089 280.9612 309.1683 328.1724 346.3216 360.7926 368.9665 399.9238 402.3546 408.4358 446.4036 464.0857 484.4337 517.2546 526.0700 559.6168 614.7609 616.0266 628.2101 637.6502 660.1230 702.5178 708.9001 725.2393 758.1502 774.3381 806.0561 809.9410 854.3124 858.2828 859.3376 876.8867 894.2400 919.9282 929.7267 937.2934 948.1468 965.6423 980.5022 983.6854 989.7054 991.0677 1000.9322 1003.6256 1008.0773 1026.6081 1028.2166 1032.7906 1071.4209 1082.6225 1099.7069 1113.4094 1130.5011 1153.9415 1170.1333 1173.1566 1175.9865 1190.4905 1195.3152 1203.8393 1217.7825 1246.6479 1277.7566 1310.3135 1321.0317 1336.7866 1353.6415 1358.3562 1376.5350 1382.2885 1399.0894 1434.1742 1437.4473 1442.1149 1446.9408 1454.9714 1475.6146 1480.5104 1589.6112 1592.2736 1605.1193 1611.7508 2987.5497 2990.6748 2997.6677 3047.8981 3060.5732 3069.9957 3082.5570 3125.2711 3125.9868 3132.9532 3133.9398 3145.8391 3146.4310 3160.6062 3162.2417 3171.8245 3180.8796 3253.4138
redmass: 6.6090 4.1134 4.8601 5.1050 3.9543 4.4455 3.9924 3.8902 8.6331 7.5212 6.9133 5.0923 4.6517 3.7265 4.6552 7.6601 5.9034 3.0781 3.9196 6.2054 5.9822 3.8535 3.1369 3.7428 4.8558 4.9960 2.3718 3.6609 3.7922 4.4374 5.9415 6.3679 2.4907 3.0464 1.9649 1.9069 1.7860 3.5953 1.7449 2.0751 3.2069 10.7706 1.2647 1.2474 1.9382 2.6166 3.0891 2.0776 1.8755 1.7456 2.9830 4.4434 1.4657 1.4081 5.5860 4.7908 1.3240 1.3476 2.3732 2.5547 2.4629 2.9958 1.8532 1.5792 1.7155 2.2168 1.4635 2.4819 1.3722 1.0697 1.1464 1.1744 1.1253 1.5883 1.6527 1.3693 1.1940 1.3517 1.3388 1.2383 1.4155 1.4488 4.5810 7.3009 1.4906 2.1210 2.1673 1.0886 1.0878 1.0875 2.1818 2.1739 6.1637 6.1304 6.0319 6.0604 1.0605 1.0618 1.0622 1.1001 1.0982 1.1034 1.0880 1.0849 1.0849 1.0880 1.0884 1.0936 1.0934 1.0964 1.0990 1.0990 1.0952 1.0675
irintensity: 1.2531 0.3878 1.0244 0.6565 2.0496 0.3783 1.4441 0.8303 8.3965 3.7798 4.7816 0.6728 3.4320 3.6148 2.7663 5.7598 3.6730 2.2921 31.3567 3.5406 9.5704 11.3621 2.6950 7.9977 3.6402 16.2203 3.8717 92.9710 80.7247 11.6722 3.1455 0.3664 21.5928 57.6945 123.3411 46.3576 59.3340 20.2773 41.7677 23.9254 9.9628 68.5442 2.8600 1.8116 11.1448 17.0700 30.5326 9.9336 9.6463 5.0136 22.4297 64.6032 0.6154 0.3123 1.4272 2.4366 0.1666 2.5977 7.1229 18.6759 10.1844 27.5227 23.3359 3.2362 5.5805 3.0966 5.0417 16.0368 2.5106 0.7194 0.6158 5.5468 3.9772 7.1501 18.8739 6.6535 17.0023 1.4612 3.2066 19.3274 4.6842 2.8316 8.2660 1.5996 49.8927 3.9939 40.3311 5.3584 11.0529 14.9905 24.3472 9.4632 0.0476 1.4462 3.9237 0.7119 22.5420 30.3530 17.4570 12.7949 9.3826 13.9516 5.2986 2.7652 4.2164 5.9123 7.3764 23.6381 33.4131 16.3697 26.6204 14.0122 9.9962 162.2344
temp: 298.150 k
press: 1.00000 atm
elementType: 16 8 8 8 8 6 6 6 6 6 6 6 6 6 6 6 6 6 6 6 6 6 1 1 1 1 1 1 1 1 1 1 1 1 1 1 1 1 1 1
symmnumber: 1
zpe: 817739.6 jmol-1
zpe.correction: 0.311461 hartree
zpe.thermalcorrener: 0.331649 hartree
zpe.thermalcorrenthalpy: 0.332593 hartree
zpe.thermalcorrgfe: 0.262447 hartree
zpe.sumelectzpe: -1355.781530 hartree
zpe.sumelectthermal: -1355.761342 hartree
zpe.sumelectthermalent: -1355.760398 hartree
zpe.sumelectthermalfe: -1355.830544 hartree
dipole: 2.8602 -4.8345 -1.8723
dipole: 5.9211
quadrupole: -142.7476 -124.3144 -134.1423
quadrupole: 14.2228 -1.2469 0.0036
quadrupole: -9.0129 9.4204 -0.4075 14.2228 -1.2469 0.0036
hfenergy: -1356.0929909 hartree
pointgroup: C01[X(C17H18O4S1)]
dipole: 1.6898752 -1.5201563 -0.5100469 debye
polarizability: 231.6327773|-11.050752|235.5608535|9.9158317|-12.75476|188.1408193 unknown
InChI: InChI=1S/C17H18O4S/c18-17(14-8-3-1-4-9-14,15-10-5-2-6-11-15)16-12-7-13-21-22(16,19)20/h1-6,8-11,16,18H,7,12-13H2
charge 0 multiplicity 1
40 atoms
S  -2.637136 -0.312866 -0.173605
O  -3.591664 -1.788081 -0.818889
O  -0.103326 -0.158753 1.873895
O  -2.859492 -0.164231 1.444308
O  -3.111921 0.853241 -1.170833
C  -0.744666 -0.978839 -0.362066
C  0.187577 -0.011066 0.447067
C  -0.730327 -2.428392 0.156885
C  -1.737543 -3.408055 -0.487143
C  0.094567 1.472434 0.021396
C  1.633278 -0.534691 0.231542
C  -3.195674 -3.057761 -0.159269
C  -0.201544 1.888077 -1.300554
C  2.329882 -1.14914 1.299608
C  0.399364 2.456383 0.996018
C  2.260014 -0.418446 -1.034594
C  -0.197294 3.25908 -1.63893
C  3.641237 -1.63737 1.103054
C  0.404994 3.825529 0.657618
C  3.566015 -0.917573 -1.230958
C  0.108341 4.233345 -0.663686
C  4.261996 -1.529878 -0.162713
H  -0.61984 -0.907039 -1.455168
H  -0.863613 -2.408919 1.254175
H  0.299811 -2.793198 -0.020753
H  -1.611762 -3.437598 -1.586549
H  -1.520927 -4.424518 -0.104997
H  -3.906188 -3.785531 -0.590366
H  -3.369783 -2.989934 0.93317
H  -1.087435 0.008617 2.011583
H  -0.465703 1.165711 -2.080632
H  1.837137 -1.220136 2.272352
H  0.626051 2.132397 2.016096
H  1.750103 0.087344 -1.862037
H  -0.448523 3.563063 -2.660786
H  4.177789 -2.100501 1.938796
H  0.638515 4.573567 1.423414
H  4.04321 -0.818906 -2.212311
H  0.106779 5.296882 -0.926919
H  5.278201 -1.910647 -0.314019
