program: Gaussian 09
title: 000283754
version: EM64L-G09RevD.01
frameworkgroup: C1[X(C19H32O2)]
method: RPBEPBE
basis: SDD
operation: Freq
keyword: #pfreq=noraman
keyword: PBEPBE/SDD
title: #p freq=noraman PBEPBE/SDD
converged: YES YES NO NO
title: Mulliken charges:
elementType: O O C C C C C C C C C C C C C C C C C C C H H H H H H H H H H H H H H H H H H H H H H H H H H H H H H H H
charge: -0.272643 -0.259582 -0.540535 -0.487108 -0.570467 0.439628 0.446255 -0.296245 -0.462680 -0.340743 -0.467005 -0.845093 -0.829096 -0.489441 -0.266885 0.374156 0.283902 -0.797262 -0.797622 -0.219176 -0.689574 0.194793 0.218689 0.202421 0.208366 0.252426 0.192540 0.250360 0.203591 0.201456 0.223281 0.227798 0.213733 0.217801 0.220581 0.235555 0.224381 0.230667 0.222688 0.232126 0.229094 0.225559 0.224336 0.214320 0.219465 0.215354 0.229941 0.211644 0.244446 0.223667 0.215109 0.229135 0.231892
chargesum: 0.00000
title: Mulliken charges with hydrogens summed into heavy atoms:
elementType: O O C C C C C C C C C C C C C C C C C C C
charge: -0.272643 -0.259582 -0.127052 -0.076321 -0.125502 0.439628 0.446255 -0.045885 -0.057633 -0.117461 -0.025474 -0.171156 -0.151360 -0.028222 -0.041326 0.374156 0.283902 -0.139141 -0.140683 0.248937 -0.013438
polarizability: 2.40831837e+02 -3.31738871e+00 1.97757253e+02 -8.73276389e+00 -8.31178005e+00 2.01808022e+02
1716.lowfreq: -10.5684 -5.9726 -2.2866 -0.0007 -0.0005 0.0003 15.8915 18.7792 26.0828
frequency: 15.7175 18.4418 25.5212 27.5220 38.6138 40.9561 47.6394 56.7723 65.9613 71.4030 82.2450 101.5657 113.1704 126.3084 137.8712 146.9996 160.2944 182.4694 192.5076 204.8991 223.6920 230.0110 256.7728 287.0992 294.2380 315.4606 334.8751 348.6107 354.3201 376.1606 402.7648 405.1117 431.4677 440.2058 462.7754 478.1136 491.5503 506.4602 546.6226 566.3253 576.2797 655.8783 734.5773 761.8129 779.0435 791.0665 802.6794 814.3758 839.9102 854.3196 856.0842 880.7068 893.1422 900.2032 929.0153 943.2935 950.4602 956.4405 985.7649 992.9610 999.6347 1006.0449 1012.9859 1020.6583 1031.0725 1035.0643 1038.9738 1047.3539 1073.3714 1080.4879 1101.3286 1113.0499 1119.1106 1137.7280 1141.3999 1153.5454 1163.6148 1184.1868 1192.0988 1206.0012 1214.0459 1232.3710 1239.2202 1242.5676 1252.3957 1296.2782 1307.5718 1309.3317 1323.0457 1326.1410 1335.9852 1359.3151 1362.1588 1367.8554 1380.5683 1385.5943 1393.3740 1395.0662 1398.6709 1399.4649 1448.8381 1451.2449 1453.0282 1455.8369 1459.2009 1460.8534 1461.5517 1463.7983 1466.9708 1470.2364 1470.9969 1471.2403 1473.4789 1476.1441 1480.1552 1481.4889 1487.4587 1628.8618 1682.9854 1684.5421 1695.3985 2943.9282 2948.9870 2951.8840 2958.6380 2959.2132 2961.1292 2962.6337 2965.5783 2980.8578 2993.5615 3002.6277 3008.1614 3014.7574 3020.7971 3024.9425 3026.0790 3029.5535 3030.9927 3035.9414 3045.9925 3062.3565 3063.3856 3073.5634 3076.6713 3078.1656 3079.8201 3089.5745 3090.1033 3091.4420 3098.0468 3100.0101 3104.0342
redmass: 3.7079 4.3981 3.2068 3.1865 3.0986 2.9790 4.3164 2.8742 3.2258 3.4021 1.5262 2.2790 2.5426 1.4537 1.1018 1.8083 2.0252 1.9653 2.4406 1.9676 2.5830 2.3989 1.4113 2.3615 2.0472 2.2301 2.8011 3.4865 2.2582 2.2929 2.2200 2.4013 2.6852 3.1068 2.5415 2.5951 2.4357 2.7719 2.3640 2.2889 4.6324 3.1933 2.0518 2.5277 2.4432 3.8638 1.1008 1.6435 1.4416 1.5545 2.2434 1.8865 2.2839 1.8377 1.9623 1.6670 1.4363 2.3320 2.0039 1.5489 1.3590 2.4002 2.5753 2.0628 2.2592 1.5626 1.7576 1.6713 1.9140 1.6591 2.1554 2.2233 2.0559 1.5021 1.9197 1.4065 1.4170 1.3981 1.2218 1.1911 2.3423 2.0139 1.6901 1.6798 1.1369 1.3558 1.2567 1.3527 1.3716 1.4766 1.4829 1.3918 1.4386 1.3799 1.3183 1.2821 1.3365 1.2836 1.2534 1.2586 1.0876 1.0728 1.0794 1.0564 1.0774 1.0815 1.0934 1.0483 1.0570 1.0618 1.0707 1.0742 1.0557 1.0608 1.0733 1.0691 1.0708 10.1904 7.0567 6.8139 6.4671 1.0642 1.0645 1.0375 1.0430 1.0387 1.0579 1.0614 1.0456 1.0661 1.0359 1.0583 1.0623 1.0928 1.0969 1.0961 1.0942 1.0951 1.0964 1.0992 1.0942 1.0909 1.1064 1.0947 1.0942 1.0923 1.0955 1.0984 1.0955 1.0978 1.0950 1.0883 1.1023
irintensity: 0.2096 0.5993 0.2332 0.1841 0.0001 0.1647 0.4166 0.3825 0.6099 0.7404 0.3851 1.1043 2.1796 0.4705 0.8958 0.9438 2.4891 0.7125 3.0722 2.1220 1.6299 0.2921 1.1146 0.6158 0.2710 0.7774 2.6482 7.5921 0.4802 0.2900 1.8580 0.6601 1.1694 12.4784 1.9945 2.1754 1.3486 2.9694 3.7062 12.0158 6.8844 2.8533 5.8853 4.9128 1.7411 8.0283 5.1613 3.8366 11.8167 19.9379 7.6654 1.8639 9.1789 17.4489 1.1353 7.2345 0.7403 30.7364 1.9389 5.4379 3.6561 1.5209 1.2477 1.6257 72.1580 2.2900 35.2727 5.2978 36.5594 3.2242 5.2274 3.1614 15.5589 6.4037 43.1202 8.2991 8.0629 0.5507 10.8924 2.4857 96.0292 3.7623 18.4939 27.3313 0.4280 2.5522 2.4482 0.2213 11.4709 1.0047 1.9738 0.9365 0.1465 1.3657 4.8889 14.1831 16.2280 18.5923 23.9863 19.8636 16.3405 4.3859 7.4644 1.1052 9.0779 8.6764 3.7535 5.1196 6.9574 25.2277 6.6128 23.6116 20.7905 10.5145 14.7907 8.7905 18.8279 196.8273 9.8126 3.5549 1.7145 21.0051 17.1175 39.6288 69.0276 25.4495 51.4205 89.9059 48.2751 43.0761 20.3811 21.7112 39.2094 41.8764 12.7685 49.6096 9.4394 25.3904 33.4932 35.9981 29.3223 3.1500 8.8842 9.4483 9.5757 55.1304 36.9149 23.9322 37.7609 29.8343 42.4296 15.2396 35.6277
temp: 298.150 k
press: 1.00000 atm
elementType: 8 8 6 6 6 6 6 6 6 6 6 6 6 6 6 6 6 6 6 6 6 1 1 1 1 1 1 1 1 1 1 1 1 1 1 1 1 1 1 1 1 1 1 1 1 1 1 1 1 1 1 1 1
symmnumber: 1
zpe: 1216506.5 jmol-1
zpe.correction: 0.463343 hartree
zpe.thermalcorrener: 0.490241 hartree
zpe.thermalcorrenthalpy: 0.491185 hartree
zpe.thermalcorrgfe: 0.401905 hartree
zpe.sumelectzpe: -891.953543 hartree
zpe.sumelectthermal: -891.926646 hartree
zpe.sumelectthermalent: -891.925701 hartree
zpe.sumelectthermalfe: -892.014981 hartree
dipole: -0.7907 0.8233 -1.7852
dipole: 2.1190
quadrupole: -124.2744 -125.9793 -129.4588
quadrupole: -2.2401 -4.1565 -2.0062
quadrupole: 2.2965 0.5916 -2.8880 -2.2401 -4.1565 -2.0062
hfenergy: -892.4168863 hartree
pointgroup: C01 [X(C19H32O2)]
dipole: 0.2478315 -0.1846302 -0.7742635 debye
polarizability: 242.4459421|0.508849|194.9108205|3.296909|8.0368848|203.0403496 unknown
InChI: InChI=1S/C19H32O2/c1-6-21-19(20)15-9-14-18(5)13-8-12-17(4)11-7-10-16(2)3/h10,12,14H,6-9,11,13,15H2,1-5H3
charge 0 multiplicity 1
53 atoms
O  2.129608 -1.98146 -0.372814
O  1.084744 -1.251277 1.57499
C  1.525197 3.037771 -0.888431
C  -0.004272 2.712104 -0.913713
C  -1.890579 0.951183 2.095194
C  -1.653268 1.86445 0.895729
C  2.42239 1.806223 -0.99056
C  -0.441442 1.866756 0.268355
C  -3.063528 -0.065572 1.922469
C  3.158559 1.400314 0.085928
C  4.052868 0.182236 0.202886
C  -2.827531 2.733212 0.47856
C  2.406308 1.1018 -2.336495
C  3.506007 -0.848698 1.241576
C  -2.788411 -1.108842 0.858718
C  -3.607597 -1.524604 -0.150238
C  2.122137 -1.360634 0.878347
C  -5.003397 -0.983627 -0.413093
C  -3.164902 -2.6113 -1.119813
C  0.808193 -2.470616 -0.874396
C  1.043502 -3.017986 -2.278282
H  1.743576 3.722451 -1.734783
H  1.750418 3.588585 0.04455
H  -0.242763 2.194642 -1.86805
H  -0.563044 3.667651 -0.9454
H  -0.964586 0.389153 2.319833
H  -2.119919 1.575537 2.986051
H  0.320436 1.170329 0.646796
H  -3.200444 -0.576099 2.899877
H  -4.006756 0.476301 1.724537
H  3.080386 2.00192 1.005866
H  4.180118 -0.326979 -0.76681
H  5.062258 0.488193 0.544965
H  -3.299128 3.210874 1.359985
H  -2.536938 3.526979 -0.230246
H  -3.612572 2.124262 -0.0133
H  1.374443 0.812666 -2.616703
H  3.022655 0.189077 -2.354884
H  2.770221 1.782451 -3.131877
H  3.433157 -0.391623 2.242952
H  4.201813 -1.707462 1.299983
H  -1.794703 -1.57798 0.943828
H  -5.284078 -0.163941 0.268412
H  -5.088518 -0.609485 -1.453218
H  -5.761128 -1.785803 -0.304359
H  -3.869679 -3.467208 -1.109948
H  -2.160835 -2.996069 -0.868879
H  -3.142515 -2.233225 -2.162465
H  0.097046 -1.624743 -0.860445
H  0.438249 -3.243392 -0.175144
H  0.092065 -3.395048 -2.696131
H  1.770169 -3.848309 -2.26409
H  1.42771 -2.229536 -2.948323
