program: Gaussian 09
title: 000283735
version: EM64L-G09RevD.01
frameworkgroup: C1[X(C10H5ClN4O4S2)]
method: RPBEPBE
basis: SDD
operation: Freq
keyword: #p
keyword: freq=noraman
keyword: PBEPBE/SDD
title: #p freq=noraman PBEPBE/SDD
converged: YES YES NO NO
title: Mulliken charges:
elementType: Cl S S O O O O N N N N C C C C C C C C C C H H H H H
charge: 0.086886 0.354875 0.322688 -0.164376 -0.124829 -0.156445 -0.188648 -0.015460 0.012747 0.026429 0.036216 0.255534 0.663743 0.513302 0.312985 -0.619033 -0.577951 -0.868115 -0.808848 -0.347021 -0.353273 0.304088 0.337240 0.369928 0.317141 0.310198
chargesum: 0.00000
title: Mulliken charges with hydrogens summed into heavy atoms:
elementType: Cl S S O O O O N N N N C C C C C C C C C C
charge: 0.086886 0.354875 0.322688 -0.164376 -0.124829 -0.156445 -0.188648 -0.015460 0.012747 0.026429 0.036216 0.255534 0.663743 0.513302 0.312985 -0.619033 -0.273863 -0.160947 -0.181509 -0.347021 -0.353273
polarizability: 2.78504493e+02 2.38428036e+00 1.98885836e+02 1.73512505e+01 -8.70315352e+00 1.40552757e+02
1716.lowfreq: -5.4901 -4.3237 -0.0011 0.0006 0.0006 1.4234 11.7435 25.2105 28.4961
frequency: 11.7391 25.2047 28.4853 38.8412 43.6027 50.2807 53.9814 72.2219 81.7829 95.4720 115.1471 136.2375 175.9241 187.4898 217.7835 230.8669 268.9908 297.6352 322.3888 341.3710 356.6180 375.6288 378.2050 387.7893 407.8300 417.8273 442.8993 495.1703 519.8641 539.5077 557.3525 591.5991 621.7747 628.8792 641.5144 657.1942 693.1270 703.1893 727.5379 739.7877 778.6591 820.0123 860.3343 905.6463 934.9247 947.4373 975.2590 1114.4789 1123.4233 1150.8030 1198.4904 1220.1836 1224.0768 1241.7625 1251.3472 1262.2154 1350.5467 1374.6975 1385.5224 1402.6461 1449.4714 1455.2731 1473.8321 1546.5853 1599.9303 2101.3283 2102.1248 3064.7468 3078.7152 3149.0887 3172.6047 3176.4858
redmass: 12.9005 12.9331 13.8757 14.2363 14.6328 15.4158 16.0515 15.3060 15.1700 16.5130 14.0755 14.7010 14.3444 12.9590 8.9573 10.4788 3.7484 14.9091 7.7176 8.9676 3.6987 12.2379 12.4707 6.8844 9.0740 8.1061 6.9140 5.1224 7.1088 6.8475 8.6297 7.1434 10.9002 11.9234 11.0000 7.3279 9.7077 6.0138 10.0961 11.7548 5.7110 6.3385 5.2158 1.6900 1.7782 1.5455 7.7624 2.5294 1.2481 1.4569 11.6372 5.0708 2.3894 1.1638 2.1919 1.6160 6.3203 6.4716 6.8055 7.8442 4.2857 1.1406 1.1966 7.7698 8.5772 12.7311 12.7208 1.0575 1.0621 1.1106 1.0925 1.1034
irintensity: 2.8107 1.7178 0.9987 1.3771 0.2405 0.4402 3.1142 0.5913 2.4327 1.8373 1.2187 4.0898 5.5536 0.6906 1.1711 5.1693 0.4015 0.9249 3.3411 4.6270 5.9085 0.2325 0.4749 2.1586 6.5224 3.2188 0.1158 2.4152 10.6398 9.1558 9.0323 0.1593 2.0077 2.0734 6.1272 4.4353 18.9034 14.4880 1.4652 7.8536 0.5595 9.3373 48.9365 0.5200 8.6474 8.9338 30.7885 3.2208 2.0730 30.8490 209.2208 73.7839 42.0078 19.7934 4.1514 7.8349 60.2892 14.7026 163.1406 27.3618 61.5442 7.1038 5.3659 29.8466 9.7311 12.7892 21.5149 2.6683 2.1630 0.2292 6.3533 21.1484
temp: 298.150 k
press: 1.00000 atm
elementType: 17 16 16 8 8 8 8 7 7 7 7 6 6 6 6 6 6 6 6 6 6 1 1 1 1 1
symmnumber: 1
zpe: 380241.4 jmol-1
zpe.correction: 0.144826 hartree
zpe.thermalcorrener: 0.166061 hartree
zpe.thermalcorrenthalpy: 0.167005 hartree
zpe.thermalcorrgfe: 0.089218 hartree
zpe.sumelectzpe: -2158.398409 hartree
zpe.sumelectthermal: -2158.377175 hartree
zpe.sumelectthermalent: -2158.376230 hartree
zpe.sumelectthermalfe: -2158.454017 hartree
dipole: -0.2557 1.1124 -1.6228
dipole: 1.9840
quadrupole: -174.4693 -161.7399 -146.9347
quadrupole: -7.7015 4.6006 2.9840
quadrupole: -13.4214 -0.6919 14.1133 -7.7015 4.6006 2.9840
hfenergy: -2158.5432351 hartree
pointgroup: C01 [X(C10H5Cl1N4O4S2)]
dipole: 0.1008588 0.4283294 0.6447084 debye
dipolederiv: -0.2547077 0.2967588 -0.0708971 0.3204762 -0.4172275 0.0620672 -0.0733275 0.0688838 0.0092684 -0.0804367 0.0522837 -0.0149333 0.1126727 0.1275929 -0.1483165 0.1000492 -0.0950323 -0.0401339 -0.3197753 -0.0000439 -0.0379042 0.0074225 0.0720394 -0.0050876 -0.077391 -0.0185807 0.2221546 -0.2926714 -0.1241433 -0.1289172 -0.1604952 -0.4622075 -0.1410025 -0.0969212 0.0071305 -0.6252038 -0.1741311 -0.1141205 0.0107643 -0.1363271 -0.525513 0.17091 -0.0423621 0.0164258 -0.5490523 -0.3430207 0.0148996 -0.1393086 0.006595 -0.7488144 -0.1159082 -0.1669404 -0.0913932 -0.322462 -0.5774237 0.0933237 -0.2658594 0.1143441 -0.497547 0.0705763 -0.3038444 0.0056044 -0.4488601 0.2403675 0.3574096 0.1269627 0.4409171 0.9732641 -0.0054874 0.1183418 0.0090674 1.0884039 0.7594489 -0.396162 0.4843536 -0.3857632 1.4336704 -0.0063069 0.5045669 0.0240137 0.622087 -0.1666086 0.0085022 -0.001486 0.0553763 -0.1940817 -0.0640406 0.0674 -0.0486218 -0.2506702 -0.3693865 -0.0086854 -0.0186484 0.0133623 -0.1775779 0.0004221 -0.125386 -0.0105085 -0.1915406 0.2090494 0.0353782 -0.0618713 -0.1065735 0.2067727 -0.0286097 -0.0722806 -0.0098063 -0.1599176 0.1491122 0.1230527 0.0105578 0.1095073 -0.3372121 0.0558031 0.1490995 0.0233781 -0.0149146 -0.2761343 0.1492789 -0.0722264 0.1266264 -0.1596206 0.0407274 -0.151487 0.0403369 -0.0129404 -0.1192466 0.1997143 -0.0980356 0.170077 -0.3983763 0.0392393 -0.1175168 0.0535306 0.0369118 0.5137375 -0.4500932 0.1140479 -0.4735992 0.712372 -0.1161219 0.1639442 -0.0400453 -0.0210978 -0.0092289 -0.1924076 0.0555827 0.0139661 0.0230503 0.0133822 0.0347054 -0.1051689 -0.0291996 0.2759257 -0.0360596 -0.1467374 -0.0468009 -0.1376546 -0.0113076 -0.1514519 -0.0320707 0.1939145 0.4784032 0.0762866 -0.1755437 0.0504216 0.0637927 0.0052877 -0.2719545 0.0113217 0.1260078 -0.1329499 -0.0439709 0.0461103 -0.1486727 0.0554625 0.1921275 -0.0034756 0.180746 0.1103229 0.2534385 -0.0243024 0.1523005 -0.0423776 -0.0261274 0.0039346 0.2883902 0.0231877 -0.107541 0.1272153 -0.0116678 -0.0007698 -0.0627811 0.0954341 -0.0111493 -0.0373955 0.0052369 0.1351528 0.0814881 -0.0172549 0.0707456 -0.0800045 0.1084218 -0.0462614 0.0401524 -0.0173713 0.0931458 0.0611318 0.0114041 0.0738686 0.0957877 0.1462726 0.0415859 0.0672086 -0.001991 0.0775753 -0.0182002 -0.0061169 0.0353337 0.0288788 0.0530458 0.0636846 0.0672241 0.0314886 0.0314037 -0.0153966 0.0067359 0.0525108 -0.0230361 0.0107686 -0.0601481 0.090652 -0.0297619 0.0271852 unknown
polarizability: 277.8333131|-4.4317399|198.8376152|19.4566882|8.9000388|141.2721574 unknown
InChI: InChI=1S/C10H5ClN4O4S2/c11-9-6(2-20-4-12)1-8(14(16)17)7(3-21-5-13)10(9)15(18)19/h1H,2-3H2
charge 0 multiplicity 1
26 atoms
Cl -1.973782 2.542855 -0.40607
S  3.778991 0.80759 -0.40418
S  -4.112021 -0.470902 0.635742
O  1.284609 2.911447 1.687356
O  1.027756 3.312498 -0.54813
O  0.920941 -3.510242 -0.053821
O  2.241035 -2.522624 1.511708
N  0.9313 2.573449 0.494266
N  1.317642 -2.484878 0.6118
N  3.339446 -1.46361 -2.22016
N  -6.696339 -0.358095 -0.761768
C  1.199686 0.083585 0.60276
C  -1.514804 -0.205603 -0.399714
C  0.366783 1.201763 0.313978
C  0.612191 -1.188509 0.347146
C  -0.959574 1.077587 -0.151012
C  -0.698137 -1.327406 -0.151395
C  2.623533 0.282057 1.062303
C  -2.916545 -0.396863 -0.902865
C  3.511044 -0.55319 -1.458429
C  -5.630395 -0.402756 -0.213677
H  -1.076014 -2.335753 -0.342968
H  2.723507 1.127143 1.759317
H  3.049245 -0.627131 1.496026
H  -3.270833 0.442236 -1.517791
H  -3.037465 -1.351443 -1.433721
