program: Gaussian 09
title: 000283728
version: EM64L-G09RevD.01
frameworkgroup: C1[X(C10H20S)]
method: RPBEPBE
basis: SDD
operation: Freq
keyword: #pfreq=noraman
keyword: PBEPBE/SDD
title: #p freq=noraman PBEPBE/SDD
converged: NO YES NO NO
title: Mulliken charges:
elementType: S C C C C C C C C C C H H H H H H H H H H H H H H H H H H H H
charge: 0.178665 -0.376446 -0.370698 -0.367852 -0.352689 -0.345023 -0.356336 -0.699707 -0.695448 -0.281505 -0.515305 0.193564 0.193605 0.189300 0.189306 0.192420 0.192436 0.188503 0.188507 0.215317 0.215259 0.194930 0.194915 0.261197 0.261242 0.209946 0.209939 0.215587 0.232172 0.217418 0.226780
chargesum: 0.00000
title: Mulliken charges with hydrogens summed into heavy atoms:
elementType: S C C C C C C C C C C
charge: 0.178665 0.010722 0.007908 0.017004 0.024320 0.085553 0.033509 -0.177267 -0.059976 -0.049333 -0.071107
polarizability: 1.99278482e+02 -2.19503743e+00 1.06519361e+02 5.27139685e-02 2.42028450e-02 8.60178208e+01
1716.lowfreq: -4.3907 -0.0008 0.0018 0.0019 6.8916 24.8551 29.4087 39.4086 51.0272
frequency: 26.4651 39.4065 42.7619 55.9043 63.7803 96.7164 99.7965 111.7628 145.8460 151.1090 173.8792 186.5752 226.5899 290.3699 345.6842 384.4043 447.5578 473.9085 568.0349 665.6558 713.5049 725.3004 732.4715 752.1682 790.4020 853.8446 883.2625 888.0969 929.9158 947.0486 987.4078 1002.6242 1018.4727 1024.6489 1044.0300 1067.3211 1069.0340 1077.0772 1081.0354 1119.4140 1186.4953 1213.5639 1220.8300 1244.4110 1258.5215 1269.8681 1284.1289 1285.8068 1286.7096 1297.7661 1301.0008 1319.8366 1346.1776 1355.9161 1356.2016 1388.6063 1394.1091 1452.7121 1463.6476 1464.3378 1468.0972 1472.7113 1476.0017 1479.4725 1486.2710 1490.5924 1601.5662 2951.6840 2954.2798 2956.9552 2964.0873 2969.6448 2971.1951 2982.0678 2986.6975 2995.1612 3006.3358 3006.5854 3022.3809 3035.8668 3046.6064 3067.7865 3070.4490 3084.7321 3096.3647 3126.2273 3207.6662
redmass: 3.8242 3.8913 2.7980 1.8368 2.2560 2.0735 3.8235 1.9451 2.0789 1.9753 4.5887 4.1375 1.1300 3.1758 3.8341 3.2245 3.2642 3.0821 1.5278 4.3021 5.8005 1.0621 1.0791 1.1046 1.1661 1.2165 1.3830 1.8896 1.2173 1.0669 4.7123 1.1534 3.7216 1.5800 2.7602 1.0862 2.8908 2.4162 2.1812 2.6256 1.7968 1.2420 1.4591 1.2501 1.2895 1.2305 1.0248 1.2695 1.1657 1.0803 1.1137 1.3478 1.4612 1.6581 1.5888 1.2168 1.1987 1.0881 1.0712 1.0702 1.0685 1.0762 1.0424 1.0791 1.0896 1.0965 4.1391 1.0587 1.0587 1.0591 1.0591 1.0583 1.0370 1.0591 1.0968 1.0990 1.1019 1.0556 1.1039 1.1044 1.1047 1.1008 1.0993 1.1091 1.0583 1.0962 1.1151
irintensity: 0.0787 0.1889 0.0686 1.2511 0.2852 0.2701 0.1134 0.1334 0.1067 0.0069 0.3673 0.1883 0.0000 0.2818 2.5974 0.5223 0.1623 0.5448 17.5930 34.8479 4.1887 13.9564 0.9578 7.5317 0.1138 2.1801 62.3940 5.5294 0.9208 52.3245 0.1013 1.3040 0.6716 19.3788 10.0594 0.6799 6.8218 0.0954 0.2972 10.6915 0.3143 3.1007 0.0500 18.6462 0.1364 8.4784 0.1821 4.4176 0.6060 0.1463 0.0097 6.8614 8.0107 0.2346 0.4972 11.4522 7.7715 5.5460 0.0259 0.3844 0.8591 1.4064 12.4629 1.6830 1.4232 29.1245 94.7702 0.0013 2.7343 0.0520 16.7686 144.6671 33.7221 37.6243 0.1179 0.4143 0.6463 35.9030 0.0387 32.2209 112.9379 99.5017 54.8033 50.1548 3.2575 8.7189 14.1911
temp: 298.150 k
press: 1.00000 atm
elementType: 16 6 6 6 6 6 6 6 6 6 6 1 1 1 1 1 1 1 1 1 1 1 1 1 1 1 1 1 1 1 1
symmnumber: 1
zpe: 721775.4 jmol-1
zpe.correction: 0.274910 hartree
zpe.thermalcorrener: 0.290405 hartree
zpe.thermalcorrenthalpy: 0.291349 hartree
zpe.thermalcorrgfe: 0.229495 hartree
zpe.sumelectzpe: -790.178151 hartree
zpe.sumelectthermal: -790.162656 hartree
zpe.sumelectthermalent: -790.161711 hartree
zpe.sumelectthermalfe: -790.223566 hartree
dipole: 1.5978 1.4885 0.0030
dipole: 2.1837
quadrupole: -84.3948 -77.7943 -80.3735
quadrupole: -5.2838 -0.0049 0.0122
quadrupole: -3.5407 3.0599 0.4807 -5.2838 -0.0049 0.0122
hfenergy: -790.4530608 hartree
pointgroup: C01[X(C10H20S1)]
dipole: 0.6210817 0.5935389 0.0086222 debye
polarizability: 199.3183199|-1.012061|106.4760494|0.3504551|0.2205038|86.0212948 unknown
InChI: InChI=1S/C10H20S/c1-3-5-6-7-8-9-10-11-4-2/h4H,2-3,5-10H2,1H3
charge 0 multiplicity 1
31 atoms
S  -4.019038 -0.818671 -0.021437
C  1.35144 -0.413315 -0.000583
C  2.618637 0.471298 0.009403
C  0.039155 0.403788 0.003173
C  3.932111 -0.343082 0.005845
C  -1.223193 -0.490971 -0.008291
C  5.199891 0.541679 0.015683
C  -2.517058 0.340513 -0.003807
C  6.507519 -0.27963 0.011945
C  -5.350245 0.42375 -0.012296
C  -6.674019 0.128065 -0.021225
H  1.370775 -1.071469 -0.894132
H  1.366865 -1.085963 0.882169
H  2.603185 1.144397 -0.873531
H  2.599203 1.130217 0.9029
H  0.024592 1.076131 -0.879893
H  0.019866 1.060396 0.897918
H  3.953694 -1.002185 -0.887418
H  3.949807 -1.016243 0.888641
H  -1.210413 -1.159883 0.875039
H  -1.205869 -1.143119 -0.904016
H  5.181145 1.214015 -0.866464
H  5.177268 1.199766 0.90844
H  -2.581538 0.966342 0.903784
H  -2.575316 0.985594 -0.898235
H  6.56805 -0.923215 -0.886261
H  6.56379 -0.938077 0.899592
H  7.398304 0.375375 0.019512
H  -4.997402 1.46318 0.001687
H  -7.416997 0.932656 -0.014387
H  -7.049108 -0.901139 -0.035158
