program: Gaussian 09
title: 000283714
version: EM64L-G09RevD.01
frameworkgroup: C1[X(C14H7BrCl2O2)]
method: RPBEPBE
basis: SDD
operation: Freq
keyword: #p
keyword: freq=noraman
keyword: PBEPBE/SDD
title: #p freq=noraman PBEPBE/SDD
converged: YES YES NO NO
title: Mulliken charges:
elementType: Br Cl Cl O O C C C C C C C C C C C C C C H H H H H H H
charge: 0.001882 -0.032595 -0.042485 -0.443254 -0.266854 -0.838461 0.112488 0.344124 0.337339 0.194468 0.144563 -0.372136 -0.362606 -0.339460 -0.276912 -0.119940 -0.108886 -0.238144 0.119209 0.328704 0.285638 0.280119 0.330060 0.309612 0.260526 0.393002
chargesum: 0.00000
title: Mulliken charges with hydrogens summed into heavy atoms:
elementType: Br Cl Cl O O C C C C C C C C C C C C C C
charge: 0.001882 -0.032595 -0.042485 -0.050252 -0.266854 -0.509757 0.112488 0.344124 0.337339 0.194468 0.144563 -0.086498 -0.082487 -0.009399 0.032700 -0.119940 -0.108886 0.022382 0.119209
polarizability: 3.26630600e+02 -1.07846419e+01 2.26152704e+02 3.18469205e-01 8.68427150e+00 8.78337522e+01
1716.lowfreq: -2.9437 -0.0018 -0.0010 0.0005 2.5519 5.1358 26.7937 34.4308 62.6120
frequency: 26.7852 34.4288 62.6114 75.1469 83.0862 121.2873 141.9812 169.9214 187.7100 207.9347 237.1101 244.5984 253.0077 336.7340 364.8914 377.7606 384.6561 426.0942 442.6865 461.8508 489.2534 554.7109 562.6050 575.0532 601.3973 608.0472 622.6268 643.9630 682.5517 714.3401 725.6720 752.9099 788.5329 829.1937 854.8528 872.3745 896.6124 903.0643 927.7850 933.8946 987.0669 1006.0824 1049.6948 1072.0804 1106.1474 1120.3596 1125.3909 1169.2699 1183.2175 1204.5886 1223.2017 1257.7031 1278.9500 1314.7888 1357.3932 1370.7761 1418.7801 1426.9507 1434.2696 1468.5671 1565.9198 1575.3212 1597.9510 1604.5413 1639.4113 3081.8119 3165.1462 3165.7595 3168.4429 3196.3273 3199.9922 3534.3574
redmass: 21.2606 10.2697 17.5655 25.0742 6.1912 14.3424 8.4191 9.7574 5.4085 7.4381 9.4662 11.2700 8.3041 10.5506 7.1977 6.4463 7.9740 5.1035 5.9071 3.8481 4.5072 5.7020 3.9464 3.5558 1.5889 5.2979 5.0982 3.8060 7.2266 6.5530 6.8076 4.3622 4.9923 8.0387 1.4155 3.1602 1.7409 1.5748 1.8279 3.1523 6.9960 1.3185 3.2209 2.0412 1.7421 1.9415 1.1514 1.3129 2.1310 2.1430 2.4997 2.2842 1.4165 2.8584 3.4724 9.1302 4.0884 3.5997 3.3981 4.6179 8.9209 8.4530 7.5858 7.6232 8.3994 1.0875 1.0934 1.0937 1.0915 1.0923 1.0948 1.0643
irintensity: 0.0397 0.6466 0.2666 0.2832 0.2733 0.2319 0.0422 0.9671 0.0517 2.8437 3.0769 0.1693 3.4792 0.2808 2.7558 4.5524 20.9596 10.0903 12.0672 27.7927 9.5459 20.9464 4.6758 30.4987 109.4076 17.4471 24.7273 50.1391 18.2333 30.3014 4.1729 28.8411 26.8929 30.9889 34.3224 35.2255 5.9180 25.6636 31.9365 67.0446 9.4499 3.2072 374.7188 34.8667 79.5473 3.1361 21.5478 33.0990 22.9351 15.2788 2.6272 25.8237 1.8167 80.4935 9.2802 24.8485 22.2520 57.6039 170.5644 15.5193 27.9185 53.0870 11.2132 29.1590 179.8200 2.0409 0.2626 0.0174 2.4813 6.5782 29.8666 73.6888
temp: 298.150 k
press: 1.00000 atm
elementType: 35 17 17 8 8 6 6 6 6 6 6 6 6 6 6 6 6 6 6 1 1 1 1 1 1 1
symmnumber: 1
zpe: 444113.5 jmol-1
zpe.correction: 0.169154 hartree
zpe.thermalcorrener: 0.185501 hartree
zpe.thermalcorrenthalpy: 0.186445 hartree
zpe.thermalcorrgfe: 0.122518 hartree
zpe.sumelectzpe: -1620.444645 hartree
zpe.sumelectthermal: -1620.428298 hartree
zpe.sumelectthermalent: -1620.427354 hartree
zpe.sumelectthermalfe: -1620.491281 hartree
dipole: 1.3508 1.4663 -1.1417
dipole: 2.2975
quadrupole: -139.7447 -122.7165 -132.1424
quadrupole: 7.4442 2.1212 6.1301
quadrupole: -8.2101 8.8181 -0.6079 7.4442 2.1212 6.1301
hfenergy: -1620.6137985 hartree
pointgroup: C01 [X(C14H7Br1Cl2O2)]
dipole: 0.5216137 -0.5607016 0.4801541 debye
dipolederiv: -0.1844731 0.0613778 -0.0238249 0.0269587 -0.5791095 0.199473 -0.0269539 0.4007518 -0.3112682 -0.900748 -0.2416048 -0.03139 -0.3138135 -0.1928069 -0.0183342 -0.0202916 -0.0129368 -0.055012 -1.0828441 0.0136558 0.1011179 0.0951671 -0.1149108 -0.0161164 0.0890265 -0.0085364 -0.0704752 -1.0729456 0.6839876 0.1187913 0.6094549 -0.7811749 -0.0633793 0.1232425 -0.0892006 -0.435206 -0.770708 -0.1157625 0.0071229 -0.1109102 -0.9384308 -0.0727338 0.0084831 -0.0940516 -0.323321 0.3275319 -0.0393312 0.0337212 -0.0359318 0.7129835 -0.3407718 0.0522577 -0.5396255 0.5061415 0.6297024 -0.3280709 -0.0527826 0.2641391 0.0325568 -0.0036821 -0.0296853 0.0576093 0.0322339 -0.2987752 -0.142852 0.0547163 -0.3442116 -0.0179868 0.0393712 -0.0352841 0.0455606 -0.1303073 -0.044448 0.0377006 -0.0548595 -0.1783106 0.0057333 0.0364112 -0.0680649 0.041474 -0.1063978 -0.2284722 0.2130196 0.0194273 -0.0033418 -0.013295 -0.0082969 0.0467326 0.0316685 -0.0131144 0.0203133 0.018348 -0.0263827 0.2693372 -0.673779 -0.0979111 0.0523411 -0.1173237 0.0042426 -0.0102135 -0.0753542 -0.0479136 -0.043455 0.0528956 0.0256179 -0.0003698 -0.0210571 -0.0453402 -0.419898 -0.0775792 0.0414597 -0.1692719 -0.0003703 0.0387556 -0.001957 -0.0219505 -0.0796737 0.0735986 -0.1750242 0.0067584 0.1763101 -0.0665984 0.013646 0.0125926 0.0036439 -0.0890848 -0.4659346 0.0646144 0.0242161 -0.4308534 -0.0195051 0.0458739 -0.0559032 0.0098888 -0.057007 1.1614773 0.4278851 0.0638456 0.8322259 0.091527 0.0003552 0.0829133 0.0044823 -0.0823997 1.4792316 -0.0102647 -0.1572284 -0.1766952 0.1701343 0.0328658 -0.1358549 0.0198333 -0.0373179 -0.4187759 0.1863282 0.0322077 0.2730116 -0.066783 0.014904 0.0663074 0.0016492 -0.1108567 1.3656572 -0.2854459 -0.0978999 -0.5364044 1.9207079 0.2382673 -0.1303767 0.2660456 0.2796294 0.0145475 0.007362 -0.007668 0.0012642 -0.0401037 0.0189508 -0.0046927 0.0586485 -0.0439469 0.1174666 0.0006945 0.0080909 -0.0231086 0.0069961 -0.0178276 -0.0038684 0.0007783 0.1446068 0.0839105 0.0269628 0.0023045 0.0501277 0.0063686 -0.0228948 0.0099411 0.0017547 0.1484758 0.2190548 -0.0284903 -0.0011317 -0.0566483 0.1017283 -0.0040155 -0.0204618 -0.0129044 0.1608695 0.0718214 0.0316924 0.0089389 0.0230297 0.141928 -0.0043871 0.0057063 -0.0032643 0.1615896 0.0240683 -0.0649239 -0.0003514 -0.0729477 0.0206277 -0.0136813 0.000423 -0.0113325 0.1572484 0.3098549 -0.1889248 -0.0212858 -0.1251223 0.2406672 -0.02046 -0.0162031 -0.0116056 0.395691 unknown
polarizability: 327.0626007|5.7874655|225.8217543|-9.4200611|-3.4723652|87.7327018 unknown
InChI: InChI=1S/C14H7BrCl2O2/c15-13-9-3-6(16)1-2-8(9)12-10(13)4-7(17)5-11(12)14(18)19/h1-5,13,18H
charge 0 multiplicity 1
26 atoms
Br -0.73398 3.476537 -1.129469
Cl 4.834727 1.551004 0.084299
Cl -5.58629 0.188704 0.436847
O  2.746092 -3.087228 -0.56353
O  0.445771 -3.165014 -0.463726
C  -0.520005 2.043312 0.350617
C  0.488833 -0.126045 -0.019503
C  0.763989 1.270568 0.175465
C  -1.586325 0.986639 0.257021
C  -0.992141 -0.298724 0.033355
C  1.606727 -1.003774 -0.193409
C  2.058446 1.802521 0.212992
C  -2.972457 1.160496 0.384379
C  -1.837671 -1.430057 -0.068542
C  2.927017 -0.460855 -0.15889
C  3.135095 0.90846 0.043837
C  -3.781808 0.010914 0.279688
C  -3.237171 -1.269437 0.054116
C  1.491836 -2.473097 -0.409904
H  -0.560338 2.669094 1.255298
H  2.226909 2.874995 0.346347
H  -3.4121 2.15045 0.53585
H  -1.411847 -2.419115 -0.237164
H  3.773804 -1.135799 -0.294193
H  -3.8974 -2.137666 -0.026044
H  2.602987 -4.060887 -0.706438
