program: Gaussian 09
title: 000283713
version: EM64L-G09RevD.01
frameworkgroup: C1[X(C14H8Cl2O3)]
method: RPBEPBE
basis: SDD
operation: Freq
keyword: #p
keyword: freq=noraman
keyword: PBEPBE/SDD
title: #p freq=noraman PBEPBE/SDD
converged: YES YES NO YES
title: Mulliken charges:
elementType: Cl Cl O O O C C C C C C C C C C C C C C H H H H H H H H
charge: -0.037935 -0.047939 -0.427968 -0.443568 -0.267915 -0.331482 0.199229 0.098975 0.177800 0.183952 0.149580 -0.390075 -0.379012 -0.337749 -0.282931 -0.109189 -0.100259 -0.242200 0.116762 0.260763 0.292124 0.286776 0.328497 0.308677 0.259317 0.344042 0.391729
chargesum: 0.00000
title: Mulliken charges with hydrogens summed into heavy atoms:
elementType: Cl Cl O O O C C C C C C C C C C C C C C
charge: -0.037935 -0.047939 -0.083926 -0.051838 -0.267915 -0.070719 0.199229 0.098975 0.177800 0.183952 0.149580 -0.097951 -0.092236 -0.009253 0.025746 -0.109189 -0.100259 0.017118 0.116762
polarizability: 3.21924316e+02 6.55216862e+00 1.95818690e+02 -4.05438881e-01 4.07591169e+00 7.42476295e+01
1716.lowfreq: -5.7111 -4.6459 -1.3465 -0.0016 -0.0008 -0.0008 32.7418 39.0436 73.2648
frequency: 32.7377 39.0412 73.2635 108.9731 119.2869 127.6918 162.1507 172.7025 203.6230 233.3414 236.0554 256.5678 324.8178 353.5586 367.3131 373.4957 385.4961 393.2825 430.7448 456.4151 480.7978 536.7450 566.3689 572.2854 596.9773 604.2353 610.5146 638.3742 668.5931 703.0480 729.1803 753.6161 786.4557 824.8523 842.0608 854.1813 893.5605 905.4199 921.1993 930.7252 983.1254 988.6791 1004.6442 1052.9049 1069.5872 1103.1218 1119.6460 1178.6689 1184.7587 1201.5216 1204.9780 1218.7514 1251.9609 1274.8864 1313.9890 1353.6255 1355.6952 1371.3414 1417.1616 1424.1812 1432.0834 1463.9693 1565.3192 1576.6591 1598.3682 1604.4628 1638.7364 3022.8762 3165.4291 3166.7691 3167.7498 3197.1500 3199.0060 3534.0123 3544.6543
redmass: 13.7273 9.3031 8.2824 6.7740 10.7185 6.5834 7.0674 6.3544 6.6587 9.0188 9.4773 5.8167 7.8277 7.6312 2.3624 1.9940 6.6262 4.4459 6.4720 3.7379 3.9117 5.7209 3.4511 5.0829 2.0115 2.7868 4.5891 4.8667 4.7052 6.4548 6.8757 5.0695 5.2236 6.4845 4.9092 1.4100 1.4594 1.6733 3.2195 1.5383 6.6465 6.9035 1.3186 3.0181 2.1378 1.7136 2.0216 1.6535 1.7776 1.6869 1.4360 2.2914 2.2425 1.4491 2.8078 1.2853 2.8013 9.2654 4.5364 3.2863 3.5060 4.3772 8.9519 8.5294 7.7161 7.7808 8.3547 1.0831 1.0930 1.0919 1.0935 1.0922 1.0948 1.0643 1.0663
irintensity: 0.3174 0.2919 0.7363 0.4115 0.1697 0.0443 0.7089 0.7383 0.9097 0.8717 0.7110 1.3730 0.5793 1.0778 23.9779 47.3627 35.1834 35.9057 9.3160 18.3408 1.0547 5.8273 10.4175 16.0323 95.9352 65.2571 23.5187 37.4537 13.2405 40.1420 6.5765 20.4077 25.7075 19.6641 46.1206 35.3004 6.9380 31.9955 79.2760 21.5661 52.4564 4.0288 1.9072 343.4385 90.0400 68.1466 2.7241 17.6936 51.3274 12.9969 16.8070 5.7547 28.4299 2.7596 78.2118 28.0209 15.3115 30.6363 3.9963 110.0053 143.2932 12.0547 24.9582 50.0830 11.8212 27.9810 185.6968 5.7610 0.3565 2.5442 0.4188 5.8959 27.5657 69.2693 11.0334
temp: 298.150 k
press: 1.00000 atm
elementType: 17 17 8 8 8 6 6 6 6 6 6 6 6 6 6 6 6 6 6 1 1 1 1 1 1 1 1
symmnumber: 1
zpe: 479823.5 jmol-1
zpe.correction: 0.182755 hartree
zpe.thermalcorrener: 0.198823 hartree
zpe.thermalcorrenthalpy: 0.199767 hartree
zpe.thermalcorrgfe: 0.138014 hartree
zpe.sumelectzpe: -1682.786815 hartree
zpe.sumelectthermal: -1682.770748 hartree
zpe.sumelectthermalent: -1682.769803 hartree
zpe.sumelectthermalfe: -1682.831556 hartree
dipole: -1.1896 1.3080 0.3888
dipole: 1.8104
quadrupole: -134.4513 -116.4879 -120.7877
quadrupole: -5.7768 0.0788 1.1366
quadrupole: -10.5423 7.4211 3.1213 -5.7768 0.0788 1.1366
hfenergy: -1682.9695706 hartree
pointgroup: C01 [X(C14H8Cl2O3)]
dipole: 0.4617854 0.5013011 -0.2067655 debye
polarizability: 321.4845735|-7.4750053|194.7235207|-9.8607352|-12.1152374|75.782541 unknown
InChI: InChI=1S/C14H8Cl2O3/c15-6-1-2-8-9(3-6)13(17)10-4-7(16)5-11(12(8)10)14(18)19/h1-5,13,17-18H
charge 0 multiplicity 1
27 atoms
Cl 4.863122 -1.574426 -0.081239
Cl -5.572252 -0.318758 0.218688
O  -0.622836 -3.281175 -0.451027
O  2.74309 3.077977 -0.516289
O  0.449736 3.14719 -0.307046
C  -0.476992 -2.105889 0.422702
C  0.799521 -1.300511 0.203239
C  0.513671 0.094773 0.033653
C  -1.553116 -1.042083 0.270639
C  -0.971837 0.251779 0.076449
C  1.62301 0.981556 -0.154722
C  2.092703 -1.83322 0.174878
C  -2.93946 -1.243676 0.319733
C  -1.829713 1.371898 -0.054945
C  2.944644 0.440273 -0.18288
C  3.160952 -0.933841 -0.026856
C  -3.762949 -0.107551 0.171637
C  -3.230733 1.185179 -0.008087
C  1.497595 2.455457 -0.323383
H  -0.492894 -2.553033 1.433967
H  2.26051 -2.907219 0.296046
H  -3.362663 -2.242239 0.460751
H  -1.413829 2.370397 -0.19004
H  3.785294 1.120272 -0.330723
H  -3.901641 2.042629 -0.112691
H  -0.662037 -2.973482 -1.39346
H  2.591304 4.055626 -0.616793
