program: Gaussian 09
title: 000283706
version: EM64L-G09RevD.01
frameworkgroup: C1[X(C15H8BrCl4NO)]
method: RPBEPBE
basis: SDD
operation: Freq
keyword: #p
keyword: freq=noraman
keyword: PBEPBE/SDD
title: #p freq=noraman PBEPBE/SDD
converged: YES YES NO NO
title: Mulliken charges:
elementType: Br Cl Cl Cl Cl O N C C C C C C C C C C C C C C C H H H H H H H H
charge: 0.007251 -0.033519 -0.036287 0.009907 0.050275 -0.212922 -0.412899 -0.034087 -0.835966 0.386398 0.254041 0.339068 0.399242 -0.421167 -0.321296 -0.365220 -0.294206 -0.129455 -0.252103 -0.115342 0.355982 -0.740057 0.329672 0.283410 0.225002 0.282736 0.328472 0.262823 0.323452 0.366794
chargesum: 0.00000
title: Mulliken charges with hydrogens summed into heavy atoms:
elementType: Br Cl Cl Cl Cl O N C C C C C C C C C C C C C C C
charge: 0.007251 -0.033519 -0.036287 0.009907 0.050275 -0.212922 -0.089447 -0.034087 -0.506295 0.386398 0.254041 0.339068 0.399242 -0.137757 -0.096294 -0.082484 0.034266 -0.129455 0.010720 -0.115342 0.355982 -0.373263
polarizability: 3.07764198e+02 2.93458252e+01 3.27849702e+02 -3.52829617e+00 -1.60438382e+00 1.23507397e+02
1716.lowfreq: -0.6582 -0.0030 -0.0026 -0.0025 2.6640 4.5700 13.6014 20.5305 39.4093
frequency: 13.5285 20.5149 39.3958 49.9961 56.5075 70.3594 76.0363 78.7356 123.7867 130.1134 154.8264 184.3333 202.3973 226.6888 234.4694 243.4054 257.8847 271.1735 285.4745 368.7915 383.1953 386.8806 403.4560 432.0217 458.7061 467.2827 549.7073 554.7914 567.3343 572.5512 587.5260 596.1875 640.3434 679.9728 683.6628 690.7379 699.3348 745.9200 750.6263 758.8774 767.2920 815.0314 867.8065 872.5848 887.2948 899.6796 920.3755 922.9852 938.8482 989.0378 1043.3999 1075.8072 1096.7586 1123.6312 1132.1874 1167.7166 1184.8656 1189.4854 1202.1929 1220.2124 1226.0731 1255.6546 1286.4504 1297.4655 1364.2582 1378.8681 1416.3719 1427.3867 1449.0532 1473.4137 1521.3510 1580.8346 1591.7486 1603.7304 1610.1209 1623.3547 3082.6191 3132.3825 3165.8792 3167.1571 3173.4761 3175.1343 3194.6576 3533.8189
redmass: 20.9047 18.7820 15.0273 13.8876 16.4255 6.0656 21.5669 8.2196 19.3431 15.6374 10.6708 6.3551 9.6621 10.3952 13.5862 8.3784 9.6676 5.8927 10.0632 6.7985 5.3602 10.2253 8.7035 4.0650 7.2146 5.1245 5.7119 5.0187 5.6372 4.1157 6.4368 4.0356 2.9068 4.2536 4.8255 3.6914 4.7558 8.1006 4.4174 5.8565 2.7917 1.8649 4.9666 2.6281 1.9637 1.6884 5.3739 1.4295 1.3925 7.3551 6.4301 2.0822 1.7217 1.1897 2.3419 1.2864 1.0873 1.8889 1.8087 1.8788 1.6216 2.5851 1.4944 2.6912 7.4864 4.5155 3.0357 4.0053 4.7112 3.8832 2.1428 7.4422 7.5038 6.7134 6.3271 6.6205 1.0873 1.0900 1.0898 1.0934 1.0938 1.0951 1.0933 1.0758
irintensity: 0.0475 0.1861 0.6610 2.8079 0.3310 0.4069 0.3221 3.4209 0.0682 3.6988 0.7599 0.6054 4.2827 1.8316 0.1841 1.1707 1.5944 1.2241 10.4595 2.0164 5.0579 20.7352 5.0661 0.4533 33.7181 37.6675 1.7721 8.5202 1.4957 5.0346 39.7756 21.2352 22.3415 47.2528 37.4209 29.0284 54.7615 7.1906 45.2173 14.8228 24.6206 44.6464 50.9085 34.6860 32.8222 18.4998 4.9758 23.1579 0.1014 8.6774 0.8318 22.7237 20.9691 23.9593 11.0321 19.2263 10.0653 12.0134 2.8015 4.1119 18.6217 18.6290 2.2759 46.9511 10.2940 13.5918 178.2175 64.3448 98.4615 11.3870 306.4727 14.0899 123.2543 11.5741 81.5880 267.2743 1.9096 16.3102 0.3435 0.1136 0.2636 1.4813 17.0606 57.5291
temp: 298.150 k
press: 1.00000 atm
elementType: 35 17 17 17 17 8 7 6 6 6 6 6 6 6 6 6 6 6 6 6 6 6 1 1 1 1 1 1 1 1
symmnumber: 1
zpe: 500912.2 jmol-1
zpe.correction: 0.190787 hartree
zpe.thermalcorrener: 0.211276 hartree
zpe.thermalcorrenthalpy: 0.212220 hartree
zpe.thermalcorrgfe: 0.136668 hartree
zpe.sumelectzpe: -2558.568686 hartree
zpe.sumelectthermal: -2558.548197 hartree
zpe.sumelectthermalent: -2558.547253 hartree
zpe.sumelectthermalfe: -2558.622806 hartree
dipole: -0.2265 -2.0044 -0.9401
dipole: 2.2255
quadrupole: -170.4683 -173.7530 -165.3295
quadrupole: -10.6459 7.6678 -3.2722
quadrupole: -0.6180 -3.9027 4.5207 -10.6459 7.6678 -3.2722
hfenergy: -2558.7594736 hartree
pointgroup: C01 [X(C15H8Br1Cl4N1O1)]
dipole: -0.2936921 -0.718571 -0.4050283 debye
polarizability: 323.8887353|30.6036206|311.2896425|-3.2308175|8.6505925|123.9429195 unknown
InChI: InChI=1S/C15H8BrCl4NO/c16-13-9-3-6(17)1-2-8(9)12-10(13)4-7(18)5-11(12)21-15(22)14(19)20/h1-5,13-14,21H
charge 0 multiplicity 1
30 atoms
Br -3.60509 2.439301 1.092453
Cl 1.878445 4.717516 -0.083555
Cl -4.958489 -3.257566 -0.471431
Cl 2.576733 -3.257554 1.520558
Cl 3.882764 -2.796437 -1.224766
O  4.088044 0.23981 0.574317
N  1.866042 -0.517854 0.28216
C  -0.280277 0.624532 -0.03622
C  -2.475211 1.542805 -0.389244
C  -1.004795 1.841795 -0.215134
C  -1.244405 -0.506005 -0.086374
C  -2.551886 0.037838 -0.303241
C  1.13326 0.687262 0.124285
C  -0.381349 3.097463 -0.237578
C  -1.1051 -1.91113 0.01877
C  -3.689414 -0.77285 -0.424412
C  1.784486 1.952289 0.110035
C  1.018546 3.116114 -0.069822
C  -2.243476 -2.743508 -0.099303
C  -3.510053 -2.168085 -0.321232
C  3.224408 -0.677533 0.472535
C  3.712074 -2.134065 0.516701
H  -2.927806 1.977507 -1.293571
H  -0.953501 4.021325 -0.35436
H  -0.149899 -2.416344 0.194834
H  -4.683502 -0.340927 -0.570446
H  2.866298 2.006441 0.240573
H  -2.142455 -3.829282 -0.01694
H  1.321119 -1.382302 0.279718
H  4.703688 -2.189355 0.978591
