program: Gaussian 09
title: 000283702
version: EM64L-G09RevD.01
frameworkgroup: C1[X(C13H7ClN2O2)]
method: RPBEPBE
basis: SDD
operation: Freq
keyword: #p
keyword: freq=noraman
keyword: PBEPBE/SDD
title: #p freq=noraman PBEPBE/SDD
converged: NO NO NO NO
title: Mulliken charges:
elementType: Cl O O N N C C C C C C C C C C C C C H H H H H H H
charge: -0.012225 -0.199221 -0.206902 0.086300 0.019785 0.369858 0.307529 0.444661 -0.095215 -0.517608 -0.355230 -0.274073 0.384868 -0.552970 -0.372239 -0.398376 -0.240649 -0.228322 0.280569 0.239985 0.278439 0.262319 0.294812 0.241349 0.242555
chargesum: 0.00000
title: Mulliken charges with hydrogens summed into heavy atoms:
elementType: Cl O O N N C C C C C C C C C C C C C
charge: -0.012225 -0.199221 -0.206902 0.086300 0.019785 0.369858 0.307529 0.444661 -0.095215 -0.237038 -0.115246 0.004366 0.384868 -0.552970 -0.109920 -0.103564 0.000700 0.014234
polarizability: 3.05990419e+02 1.71819907e+01 2.06071545e+02 2.39666139e-02 1.55257073e-02 6.18432542e+01
1716.lowfreq: -16.8506 -8.0588 -6.7877 -0.0022 -0.0020 -0.0020 42.1306 52.3536 88.0320
frequency: 42.0725 52.3498 88.0160 128.7479 131.2003 167.8897 206.1030 243.2919 255.0697 290.5995 344.6675 388.9133 416.8876 438.0225 439.4082 463.2460 505.7445 515.7199 564.1837 565.8642 619.8525 630.1209 635.3363 697.2021 711.3684 742.5032 744.0701 772.5769 779.6688 796.6280 865.9972 866.6579 888.9459 929.0806 935.9280 973.4377 1002.4734 1004.9547 1015.8913 1043.1326 1089.5374 1108.5547 1138.1101 1183.5113 1199.5131 1217.3393 1241.4410 1265.1222 1294.8981 1309.3390 1372.1107 1378.6598 1400.9175 1427.7611 1440.4099 1451.3280 1477.7767 1527.0847 1572.8425 1578.4941 1617.8367 1625.2513 3143.6731 3156.7116 3168.4271 3171.5360 3179.5857 3182.0151 3193.7719
redmass: 11.8390 10.9736 4.4640 4.8018 9.6653 8.1864 11.2103 4.6704 9.7656 10.9839 7.0266 9.6554 3.3844 3.4205 7.2612 7.5119 9.3258 3.5788 4.5230 6.0036 7.0602 4.4741 9.5507 5.4953 6.8133 7.9896 3.9888 7.8568 1.4659 2.6057 1.5639 7.4235 1.6644 7.5415 1.5568 1.3764 1.3350 1.3472 4.5060 2.0042 2.7116 1.9491 1.4391 1.0955 2.9626 8.6823 1.8302 1.6418 2.7226 2.3208 5.5084 6.0459 5.9052 3.2574 3.7669 4.4005 3.0240 4.8083 8.9397 7.9601 6.5471 7.0687 1.0862 1.0897 1.0953 1.0898 1.0933 1.0973 1.0972
irintensity: 1.3065 0.7913 0.3775 0.5925 2.8527 4.1499 0.1840 0.0375 3.8858 1.3340 0.0283 10.8105 1.1012 4.1309 13.7033 0.6222 3.3774 0.5133 2.1253 6.1972 5.9858 5.3809 0.7934 30.6504 5.0587 6.1834 0.8199 60.4613 74.0131 1.0765 39.6121 0.5803 0.1306 77.3846 21.4920 2.4266 0.1851 0.0002 0.4383 15.4952 10.9858 8.9270 16.9069 5.7518 201.0933 319.7809 17.3719 53.3078 36.7195 38.5267 32.8122 67.3686 3.7322 7.8628 54.5804 48.4804 19.1397 83.5395 53.0702 77.8734 21.1073 7.3672 0.9962 7.7845 8.8959 2.4833 5.5255 11.2344 2.1015
temp: 298.150 k
press: 1.00000 atm
elementType: 17 8 8 7 7 6 6 6 6 6 6 6 6 6 6 6 6 6 1 1 1 1 1 1 1
symmnumber: 1
zpe: 448703.6 jmol-1
zpe.correction: 0.170902 hartree
zpe.thermalcorrener: 0.184468 hartree
zpe.thermalcorrenthalpy: 0.185412 hartree
zpe.thermalcorrgfe: 0.129472 hartree
zpe.sumelectzpe: -1218.315370 hartree
zpe.sumelectthermal: -1218.301804 hartree
zpe.sumelectthermalent: -1218.300860 hartree
zpe.sumelectthermalfe: -1218.356800 hartree
dipole: 4.0114 2.3692 0.0026
dipole: 4.6588
quadrupole: -129.6236 -101.7852 -111.5611
quadrupole: 17.2741 -0.0109 0.0018
quadrupole: -15.3003 12.5381 2.7622 17.2741 -0.0109 0.0018
hfenergy: -1218.4862722 hartree
pointgroup: C01 [X(C13H7Cl1N2O2)]
dipole: -1.6874344 0.7156441 -0.0010152 debye
dipolederiv: -0.8315514 -0.4286596 -0.0000028 -0.4724337 -0.4262473 0.0000059 -0.0000064 0.0000084 -0.0844177 -1.0716447 0.1172636 -0.0000873 0.0868093 -0.4713059 -0.0000667 -0.0007996 0.0002965 -0.2242069 -0.622449 -0.0934111 -0.0001632 -0.3410121 -0.8039889 0.0004 -0.0002675 -0.0003063 -0.226326 -1.3096456 -0.1784628 -0.0000666 0.3576809 -0.3623088 0.0000354 -0.0000601 0.0000167 -0.1783419 2.0530498 0.1887651 0.0004996 0.5923857 1.1537652 -0.0002447 0.0006982 -0.0001514 0.1863392 -0.1493184 -0.2376147 -0.0000074 -0.2269225 -0.1964536 0.0000046 0.0000058 0.0000194 0.0371307 0.1839124 0.1253589 -0.0000043 -0.3421989 0.1334695 -0.0000427 -0.0000118 -0.0000188 0.0154346 -0.157325 -0.252579 0.0000178 -0.1722693 -0.4570023 0.0000472 -0.0000037 0.0000385 0.0840532 0.757011 0.1305158 0.0000288 0.150217 0.1032382 0.0000066 0.0000372 0.0000138 0.0595943 0.3046978 0.2277139 0.0000098 -0.0301033 -0.047935 -0.0000494 0.0003057 0.0000888 -0.1032467 -0.1452568 0.1313589 -0.000018 0.2536519 -0.0937328 0.0000102 -0.0000158 -0.0000025 -0.1309591 -0.3889378 -0.0173297 -0.0000355 -0.0675918 0.1887235 -0.000032 0.0000255 -0.0000542 -0.1233862 -0.8374236 -0.2310021 -0.0002284 -0.3264609 -0.0395018 -0.0000484 -0.0000427 0.0000728 0.0687773 1.6514494 0.6594701 0.0000358 0.2009482 1.0195366 -0.0000954 0.0000816 -0.0000728 0.0203145 0.0011424 -0.0256321 0.000006 0.2139903 0.0266677 -0.0000099 -0.0000233 -0.0000101 -0.1205329 0.060897 -0.0443494 -0.0000007 0.2612917 -0.0051136 0.0000346 0.0001691 -0.0000105 -0.1237927 0.0577724 0.0277436 0.0000074 0.0114088 0.1986481 -0.0000286 0.0000094 -0.0000235 -0.1257215 0.0939093 -0.1012203 0.00002 -0.1472039 -0.1237876 -0.0000054 0.00002 -0.0000044 -0.1398238 0.1470388 0.0102944 0.0000093 0.0146074 0.0247572 0.0000214 -0.0000161 0. 0.1569196 -0.0129765 -0.1021903 0.0000074 -0.0588802 0.0522254 0.0000042 -0.0000024 0.0000041 0.1467171 0.0966033 -0.0253777 -0.0000095 0.0097628 -0.0159392 0.0000112 -0.0000645 0.0000123 0.1574118 0.0346154 -0.029674 -0.0000004 -0.0919829 0.0739428 0.000005 0.0000097 0.0000095 0.1571485 0.0663069 0.0553493 0.0000029 0.0091093 0.1154833 -0.0000011 -0.0000254 0.0000386 0.174781 0.0888557 0.0109672 -0.0000041 0.035475 -0.0973345 0.0000252 -0.0000076 0.0000251 0.1571865 -0.0707327 0.0827018 -0.0000168 0.0797212 0.0501939 0.0000128 -0.0000153 0.0000098 0.1589467 unknown
polarizability: 308.7457215|-3.5103276|203.316243|0.0258062|-0.0122265|61.8432542 unknown
InChI: InChI=1S/C13H7ClN2O2/c14-13-10-4-2-1-3-9(10)11-7-8(16(17)18)5-6-12(11)15-13/h1-7H
charge 0 multiplicity 1
25 atoms
Cl -3.622103 -2.625685 0.000019
O  4.984919 0.051414 0.001425
O  3.840339 2.022847 0.000429
N  -0.978841 -2.180635 0.000077
N  3.889516 0.732521 -0.000131
C  0.172945 0.019022 -0.000122
C  -1.128126 0.69048 -0.000207
C  -2.325408 -0.117157 -0.000157
C  0.197816 -1.422775 0.000009
C  1.41225 0.710919 -0.000215
C  -1.273241 2.107599 -0.000339
C  1.436614 -2.127527 0.000098
C  2.609721 -0.015606 -0.000081
C  -2.127434 -1.555874 0.000003
C  -3.607076 0.503162 -0.00026
C  2.648689 -1.435833 0.000064
C  -2.541824 2.701533 -0.000429
C  -3.715288 1.898233 -0.000398
H  1.472452 1.801929 -0.000367
H  -0.386869 2.748305 -0.000377
H  1.397157 -3.220222 0.000201
H  -4.499947 -0.127949 -0.000222
H  3.613736 -1.947671 0.000187
H  -2.630175 3.79272 -0.00053
H  -4.701324 2.372746 -0.000476
