program: Gaussian 09
title: 000283701
version: EM64L-G09RevD.01
frameworkgroup: C1[X(C14H9BrN2O2)]
method: RPBEPBE
basis: SDD
operation: Freq
keyword: #p
keyword: freq=noraman
keyword: PBEPBE/SDD
title: #p freq=noraman PBEPBE/SDD
converged: NO NO NO NO
title: Mulliken charges:
elementType: Br O O N N C C C C C C C C C C C C C C H H H H H H H H H
charge: 0.017821 -0.255642 -0.232223 -0.452464 -0.419031 0.354800 0.083201 0.287856 0.123605 0.356406 -0.022124 -0.338376 -0.348040 -0.304422 -0.347137 -0.305404 -0.239550 -0.236261 -0.053563 0.312823 0.241975 0.226344 0.329332 0.279286 0.235275 0.239618 0.289239 0.176656
chargesum: 0.00000
title: Mulliken charges with hydrogens summed into heavy atoms:
elementType: Br O O N N C C C C C C C C C C C C C C
charge: 0.017821 -0.255642 -0.232223 -0.139641 -0.129792 0.354800 0.083201 0.287856 0.123605 0.356406 -0.022124 -0.096401 -0.121696 0.024910 -0.067851 -0.305404 -0.004275 0.003357 0.123093
polarizability: 3.11334153e+02 1.13810332e+01 2.37143052e+02 -8.48463849e-03 5.25243081e-03 6.81191281e+01
1716.lowfreq: -111.1109 0.0003 0.0007 0.0008 4.9144 6.1820 11.7457 37.9099 65.4457
frequency: -111.1103 37.7022 65.4342 108.2730 132.6376 133.6624 134.6962 163.6888 237.1542 238.2191 238.5500 284.9304 320.1845 342.5380 399.0560 404.0937 448.4703 463.4946 468.8253 488.2989 488.4097 540.9186 573.8145 602.2293 622.1657 625.5371 632.2063 709.7829 716.9236 745.1356 786.2572 788.4840 794.7121 834.6979 865.5815 873.0460 880.2685 895.5331 925.9749 948.7761 981.1793 1009.0308 1031.9717 1057.7980 1087.4931 1111.2588 1131.7089 1160.2806 1182.2964 1248.5432 1256.6621 1272.7764 1301.5121 1321.8591 1360.0780 1382.3475 1393.8305 1416.4741 1419.8577 1432.9112 1461.4596 1486.9224 1508.6441 1562.3416 1587.8860 1597.7459 1618.1618 1637.8979 1650.5088 2931.5485 3134.8222 3149.2434 3160.6903 3172.3842 3186.0098 3196.8499 3517.3621 3541.6416
redmass: 2.5995 8.7181 6.2449 13.2045 4.7709 7.7068 4.4634 6.0174 14.9070 3.9070 12.1343 6.6317 3.3719 8.0074 4.1241 2.9666 7.0518 7.4002 2.0390 3.8363 4.3786 8.1468 4.2439 4.2434 6.7539 1.5048 6.7906 2.2991 6.4279 3.4972 1.9911 7.2459 2.3936 6.8364 4.9806 1.7304 6.8947 1.4957 1.4154 1.5412 1.3809 1.3453 3.0999 3.6314 3.1023 2.1489 2.4198 1.7238 1.1296 1.8946 1.5165 2.6205 3.5042 2.4269 3.3575 1.8537 3.2761 2.7418 2.4805 2.8921 2.7890 3.0619 2.4377 6.3798 6.8864 7.3998 6.3060 5.1091 3.5749 1.0872 1.0860 1.0896 1.0949 1.1003 1.0911 1.0937 1.0758 1.0754
irintensity: 17.6143 0.0000 0.5320 0.5938 0.1031 5.9426 4.4191 2.9352 1.0680 3.9425 3.6233 12.7564 10.5439 2.5631 0.0408 1.6092 5.1316 4.0928 7.1861 4.2202 4.4400 24.6354 19.3021 1.5195 9.7111 58.2502 3.1082 117.4010 3.6656 10.8884 72.6565 17.1910 2.8917 18.0892 35.4142 15.8190 7.6750 0.0344 20.6123 6.3646 2.2305 0.3472 23.6232 9.8602 7.2799 12.7026 13.2800 38.6594 1.2941 7.6307 30.2019 97.3738 1.7236 118.6444 35.7886 22.1781 11.0182 238.1286 68.0434 4.8654 53.1315 13.5060 272.9663 15.5564 118.5671 102.1281 34.6004 242.4007 328.9481 108.4362 2.5178 9.7276 8.5719 22.1872 1.8962 23.5733 10.9214 5.8994
temp: 298.150 k
press: 1.00000 atm
elementType: 35 8 8 7 7 6 6 6 6 6 6 6 6 6 6 6 6 6 6 1 1 1 1 1 1 1 1 1
symmnumber: 1
zpe: 524098.1 jmol-1
zpe.correction: 0.199618 hartree
zpe.thermalcorrener: 0.214338 hartree
zpe.thermalcorrenthalpy: 0.215283 hartree
zpe.thermalcorrgfe: 0.156714 hartree
zpe.sumelectzpe: -811.048871 hartree
zpe.sumelectthermal: -811.034151 hartree
zpe.sumelectthermalent: -811.033207 hartree
zpe.sumelectthermalfe: -811.091776 hartree
dipole: -2.6245 -0.4876 0.0047
dipole: 2.6695
quadrupole: -137.5433 -101.3307 -123.0514
quadrupole: 12.1670 0.0103 0.0160
quadrupole: -16.9015 19.3111 -2.4096 12.1670 0.0103 0.0160
hfenergy: -811.2484899 hartree
pointgroup: C01 [X(C14H9Br1N2O2)]
dipole: 1.0312314 0.1989278 -0.0018435 debye
polarizability: 309.1635648|16.9072403|239.3136397|-0.0059771|-0.0079907|68.1191281 unknown
InChI: InChI=1S/C14H9BrN2O2/c15-8-5-11-9-3-1-2-4-10(9)14(19)17-13(11)12(6-8)16-7-18/h1-7,16-17H
charge 0 multiplicity 1
28 atoms
Br -2.782372 -3.734232 0.000206
O  1.953817 3.105554 0.000329
O  -5.022182 0.875636 0.001311
N  0.093045 1.727973 -0.000002
N  -2.773359 1.635884 -0.00092
C  0.197467 -0.706461 -0.000154
C  -0.579107 0.493934 -0.000214
C  1.669594 -0.606731 -0.000133
C  2.294167 0.681498 -0.000074
C  -2.013854 0.42936 -0.000449
C  1.488972 1.924133 0.000071
C  -0.47414 -1.959462 -0.00007
C  2.517895 -1.752332 -0.000177
C  -2.659198 -0.828291 -0.000263
C  3.707674 0.809713 -0.000056
C  -1.872345 -1.997667 -0.000049
C  3.917051 -1.619149 -0.000171
C  4.522606 -0.333659 -0.000111
C  -4.162746 1.793138 -0.000439
H  -0.411682 2.618095 0.000496
H  0.092475 -2.8921 0.000046
H  2.088184 -2.758413 -0.000242
H  -3.748889 -0.869955 -0.000321
H  4.127218 1.820707 0.000008
H  4.544151 -2.517546 -0.000217
H  5.613413 -0.23804 -0.000098
H  -2.2744 2.526864 -0.002103
H  -4.433554 2.874652 -0.000601
