program: Gaussian 09
title: 000283700
version: EM64L-G09RevD.01
frameworkgroup: C1[X(C14H8O2)]
method: RPBEPBE
basis: SDD
operation: Freq
keyword: #pfreq=noraman
keyword: PBEPBE/SDD
title: #p freq=noraman PBEPBE/SDD
converged: YES YES NO NO
title: Mulliken charges:
elementType: O O C C C C C C C C C C C C C C H H H H H H H H
charge: -0.235647 -0.180493 -0.346712 -0.020971 0.278886 0.253777 0.217874 0.162715 0.097708 -0.386424 -0.397478 -0.402362 -0.376236 -0.194624 -0.229354 -0.219553 0.263440 0.246080 0.260736 0.246752 0.264885 0.230584 0.234179 0.232237
chargesum: 0.00000
title: Mulliken charges with hydrogens summed into heavy atoms:
elementType: O O C C C C C C C C C C C C C C
charge: -0.235647 -0.180493 -0.083272 -0.020971 0.278886 0.253777 0.217874 0.162715 0.097708 -0.140344 -0.136742 -0.155609 -0.111351 0.035960 0.004825 0.012684
polarizability: 2.28420015e+02 -7.09023707e+00 1.67678827e+02 1.15608005e+00 -3.77233565e+00 6.85940473e+01
1716.lowfreq: -0.0005 0.0007 0.0009 0.9220 5.2186 7.6937 82.3463 110.3540 167.2238
frequency: 82.3445 110.3532 167.2236 177.2709 197.7280 267.0648 286.8148 388.6737 419.3641 428.2645 468.1781 472.2588 547.3838 567.9296 574.4119 600.7111 624.0862 658.7869 671.1051 691.8368 735.3874 750.6118 770.0685 803.3244 812.8776 832.0592 861.7237 873.3272 889.7741 910.5443 951.0991 959.8354 980.6956 994.7316 1019.8773 1033.1318 1051.8181 1099.7132 1148.4536 1166.2390 1174.8702 1182.6244 1212.4882 1255.6268 1266.9599 1271.7125 1299.7175 1367.8360 1396.9593 1434.3790 1439.1785 1460.0995 1475.0618 1582.7329 1595.1772 1619.6349 1650.6756 1710.7337 2990.3510 3131.2513 3136.4686 3141.3743 3152.5226 3154.6351 3168.4111 3172.1749
redmass: 7.0213 4.5068 5.3455 5.2449 7.2849 4.2678 6.1073 6.6690 3.2399 5.5117 4.7190 5.1684 6.2033 4.6997 5.7527 6.4919 6.7711 4.7434 6.0538 5.9816 2.6482 3.2434 1.5550 3.6675 2.4617 3.7477 6.8114 3.9496 1.5294 1.4988 3.8572 1.7246 1.3587 1.3370 2.3476 2.3236 3.1092 2.1274 1.4554 1.5236 1.2632 1.5106 2.8857 1.3734 2.3121 1.5253 1.8196 5.5988 3.9534 2.4073 3.0287 2.8954 4.2251 6.0231 8.4684 7.4137 9.8283 13.0174 1.0826 1.0858 1.0872 1.0899 1.0951 1.0931 1.1004 1.0975
irintensity: 0.4045 2.4964 1.0267 1.6844 1.9609 1.8564 0.8705 0.9983 3.4602 0.8237 2.2213 2.2522 3.0921 0.7265 3.7698 6.8085 1.3255 4.7790 2.2229 44.4308 26.7361 21.9519 102.9465 36.6625 15.9308 2.6205 83.8280 36.4592 0.0598 2.8715 29.6419 8.5101 0.4639 0.0665 3.1010 0.9345 5.1502 3.8616 1.3942 12.8382 5.7804 2.3456 9.0596 6.7197 6.4725 4.3893 3.0021 9.5639 1.9111 27.4998 11.7696 2.1087 3.2206 0.8586 3.6064 3.3585 10.8469 463.1678 6.9714 1.5409 5.3467 2.7450 13.0644 15.2414 28.9574 12.4683
temp: 298.150 k
press: 1.00000 atm
elementType: 8 8 6 6 6 6 6 6 6 6 6 6 6 6 6 6 1 1 1 1 1 1 1 1
symmnumber: 1
zpe: 463497.6 jmol-1
zpe.correction: 0.176537 hartree
zpe.thermalcorrener: 0.187355 hartree
zpe.thermalcorrenthalpy: 0.188299 hartree
zpe.thermalcorrgfe: 0.139867 hartree
zpe.sumelectzpe: -687.654718 hartree
zpe.sumelectthermal: -687.643899 hartree
zpe.sumelectthermalent: -687.642955 hartree
zpe.sumelectthermalfe: -687.691387 hartree
dipole: 3.9111 4.2168 0.8357
dipole: 5.8117
quadrupole: -88.0734 -88.0841 -93.6405
quadrupole: -12.9842 -3.0177 -5.7532
quadrupole: 1.8593 1.8486 -3.7079 -12.9842 -3.0177 -5.7532
hfenergy: -687.8312546 hartree
pointgroup: C01 [X(C14H8O2)]
dipole: 1.5193488 1.6828036 0.2965003 debye
dipolederiv: -1.1000261 -0.03245 -0.1608144 0.1405551 -0.4805465 0.0752186 -0.1317801 -0.028904 -0.3074059 -1.1084523 -0.3822314 -0.1579341 -0.4519585 -0.696578 -0.095696 -0.3099476 -0.1912747 -0.3648355 0.5098413 0.1547489 0.0188422 0.290514 0.1949674 0.051012 0.1877868 0.0313698 0.352389 -0.2394673 0.1851873 0.0348031 -0.1536931 0.0377125 -0.101036 0.1251554 -0.0735377 -0.0790665 -0.0549333 -0.0039796 -0.0413084 0.0939836 -0.0772077 -0.032444 -0.0908214 -0.0545802 -0.0622843 0.297391 -0.212122 -0.0316551 -0.0062997 -0.0944339 0.0172874 -0.2068107 0.084062 0.0058083 0.1999567 0.0177996 -0.0195453 -0.0707903 -0.0174351 0.0163317 0.0148133 -0.0015012 0.0037711 -0.074941 -0.1283042 -0.0095636 -0.2162209 -0.4556173 -0.0423408 -0.0257942 0.0021389 0.0068965 1.819975 0.4200192 0.3099465 0.3166218 1.2616609 0.1117069 0.3935453 0.2818831 0.3328099 0.0031023 0.1153954 0.019639 0.0447652 0.0434475 -0.086708 0.1112079 -0.0988874 -0.1084372 -0.0751156 0.0253629 0.0031104 -0.0786201 0.1493711 -0.0072034 -0.0142882 0.0209156 -0.1299016 -0.1280069 -0.0079176 -0.0122122 0.0461956 0.0966777 0.0006627 -0.0074869 -0.0047387 -0.1398128 -0.0196572 -0.035079 0.0854822 0.2180117 0.0366272 -0.0169146 0.0108999 -0.0822397 -0.1069025 -0.1368515 -0.1160918 0.0245324 -0.2133257 0.0818094 -0.0636915 0.0019997 -0.0358493 -0.1337266 -0.0412138 -0.0404649 -0.0518651 -0.0911847 -0.0079554 0.0139981 -0.0203924 0.0163365 -0.1464026 0.0889749 0.0620691 -0.0633354 0.1512243 -0.0553802 -0.014067 -0.061246 -0.0194808 -0.1248507 -0.0280401 -0.0312635 0.0001489 -0.0345612 0.035601 0.0656314 -0.039995 0.0165956 -0.0368456 0.048639 -0.0950703 0.0141184 -0.0624681 -0.0207494 0.0368128 0.0141158 0.0521595 0.1447906 0.0933808 -0.0298734 0.0142822 0.014617 -0.0627375 0.0118945 0.0036838 0.0118393 0.1520108 0.0929547 0.0170947 0.0153198 -0.0296908 -0.0865363 0.0078267 0.0231631 0.0089574 0.1516321 -0.0249202 0.0190572 -0.0515365 -0.0083071 0.0964542 0.0036628 -0.0475954 0.0102741 0.1500603 0.0333643 0.0771344 -0.0303854 0.088234 -0.0638905 0.0478769 -0.0455197 0.0611717 0.1419422 -0.0616179 0.0886892 0.0417451 0.0949387 0.0313882 -0.0186252 0.0564163 -0.0233448 0.1524104 -0.0943365 -0.0677103 0.0481855 -0.0825409 0.0533507 0.0188038 0.0588904 0.016635 0.1459506 unknown
polarizability: 228.5722115|-6.361562|167.3342211|1.4658526|-5.7402984|68.7864565 unknown
InChI: InChI=1S/C14H8O2/c15-14-11-7-3-6-9-8-4-1-2-5-10(8)13(16-14)12(9)11/h1-7,13H
charge 0 multiplicity 1
24 atoms
O  -1.058915 -2.110796 0.009729
O  -3.35139 -2.047015 -0.534403
C  -0.100879 -1.158275 0.68345
C  -0.808168 0.145286 0.552562
C  1.300348 -0.774789 0.192012
C  0.022629 1.244912 0.29492
C  1.390908 0.668618 0.133458
C  -2.131989 0.027024 0.155773
C  -2.354009 -1.430592 -0.138255
C  -0.640708 2.44778 -0.054296
C  2.434912 -1.571855 -0.017685
C  2.628404 1.284705 -0.14128
C  -2.814896 1.214285 -0.212933
C  -2.05839 2.419248 -0.237885
C  3.670024 -0.940879 -0.3188
C  3.764718 0.470303 -0.370939
H  -0.027891 -1.531319 1.724673
H  -0.091655 3.36969 -0.274305
H  2.366019 -2.663623 0.03135
H  2.714723 2.375878 -0.18344
H  -3.859014 1.200834 -0.539922
H  -2.565099 3.349827 -0.517012
H  4.558835 -1.551533 -0.510378
H  4.729483 0.938885 -0.594195
