program: Gaussian 09
title: 000283693
version: EM64L-G09RevD.01
frameworkgroup: C1[X(C16H12N6)]
method: RPBEPBE
basis: SDD
operation: Freq
keyword: #pfreq=noraman
keyword: PBEPBE/SDD
title: #p freq=noraman PBEPBE/SDD
converged: YES YES NO NO
title: Mulliken charges:
elementType: N N N N N N C C C C C C C C C C C C C C C C H H H H H H H H H H H H
charge: -0.285166 -0.091364 -0.081416 -0.007215 -0.081675 -0.588919 0.292372 -0.118410 0.315686 0.338159 0.005025 -0.367722 -0.344291 -0.377340 -0.377287 0.059090 -0.222861 -0.252853 -0.232704 -0.227228 -0.234619 -0.241613 0.262757 0.265937 0.250718 0.270629 0.234246 0.232019 0.234426 0.228948 0.229759 0.230329 0.336085 0.346497
chargesum: 0.00000
title: Mulliken charges with hydrogens summed into heavy atoms:
elementType: N N N N N N C C C C C C C C C C C C C C C C
charge: -0.285166 -0.091364 -0.081416 -0.007215 -0.081675 0.093663 0.292372 -0.118410 0.315686 0.338159 0.005025 -0.104965 -0.078354 -0.126622 -0.106659 0.059090 0.011385 -0.020834 0.001723 0.001720 -0.004860 -0.011284
polarizability: 3.39314311e+02 5.15733335e-01 2.44339705e+02 -1.44667828e+01 -1.96446776e+01 1.20763758e+02
1716.lowfreq: -6.0904 0.0004 0.0005 0.0006 4.2341 4.6473 36.4049 47.5521 57.6270
frequency: 36.3981 47.5312 57.6169 70.0243 85.2133 108.0219 157.2333 191.0157 218.9131 220.7578 258.2412 266.9329 315.4703 351.8332 382.5331 398.7017 405.9238 430.5883 443.8466 458.4806 467.3826 507.3591 557.0631 560.7953 579.4195 612.7716 616.8323 636.3437 651.3827 670.0509 695.3431 700.1032 707.4271 725.4922 749.7725 756.2941 769.3536 778.4823 846.9660 851.9874 866.1704 921.5614 925.9506 928.0094 975.1856 977.1900 978.8949 989.4065 990.0157 997.1825 998.7330 1003.1428 1026.4657 1028.3870 1047.8374 1077.6151 1084.4408 1100.2875 1138.3619 1173.6956 1176.3683 1191.8900 1198.9521 1202.3152 1218.3974 1303.8917 1321.5916 1325.2799 1327.5030 1374.4398 1377.4291 1413.8551 1428.2115 1444.3443 1446.7926 1488.3960 1493.3612 1509.5028 1553.1738 1582.9901 1584.1357 1608.7564 1611.0760 1633.9741 3127.2636 3131.1963 3137.7695 3142.3642 3150.8797 3155.1356 3161.9157 3167.3468 3172.3470 3179.1854 3572.2884 3723.3582
redmass: 5.8567 4.2219 4.5540 4.4535 5.7176 5.1434 5.7974 7.4333 5.0550 5.4639 5.5942 5.1435 5.2936 6.1304 6.7233 2.8006 2.8379 4.4168 1.2358 1.2232 3.4798 3.8606 7.3128 9.1417 5.5141 6.4307 6.4253 8.5550 6.8444 7.4279 1.8059 1.7883 8.8808 6.6391 5.1558 6.4403 2.1419 2.5035 1.2614 1.2572 6.5676 4.2311 1.5258 1.5657 1.5968 3.0349 1.7409 6.0506 5.5142 1.3282 1.3335 2.5144 2.5149 2.3781 4.0718 2.7753 1.6647 2.2082 6.1197 1.0535 1.0544 1.1336 1.1939 5.9439 5.3834 3.3296 1.6107 1.5714 3.2311 6.0183 6.5779 3.7924 2.9170 2.7725 3.6893 2.5995 3.3610 7.6812 1.8542 5.9045 6.0216 5.9193 6.0220 2.2133 1.0849 1.0853 1.0886 1.0890 1.0935 1.0940 1.0968 1.0981 1.0995 1.0978 1.0447 1.1056
irintensity: 2.7947 0.7613 0.3227 0.0821 0.4695 1.2699 1.3064 0.5722 0.3596 1.9363 1.2895 0.6461 3.7496 5.2398 11.0321 0.4184 0.2178 4.2127 130.5127 164.1700 18.8697 6.9334 6.9073 2.2294 8.5925 1.9223 1.0377 12.1348 11.5876 1.1099 44.1427 57.1798 16.9724 17.5936 2.3688 7.3733 57.8429 18.8099 1.7707 0.7770 1.6210 6.2902 1.9176 4.2377 2.5651 20.9836 2.4111 2.6548 1.8949 0.6043 0.3452 14.0596 5.5671 6.3517 13.4747 34.9057 2.7881 3.7830 9.6224 0.1020 0.0730 4.3395 13.9071 50.8374 4.4526 60.5323 8.1949 1.8654 26.3614 2.7996 5.1635 116.5401 57.9475 57.5965 48.0817 0.6263 28.0016 160.4104 121.3095 0.8699 1.4692 3.1105 0.9846 706.0711 0.5453 0.1065 6.9396 7.0716 31.7214 23.4178 20.2356 17.2706 13.5105 6.6920 220.4245 56.9583
temp: 298.150 k
press: 1.00000 atm
elementType: 7 7 7 7 7 7 6 6 6 6 6 6 6 6 6 6 6 6 6 6 6 6 1 1 1 1 1 1 1 1 1 1 1 1
symmnumber: 1
zpe: 665196.1 jmol-1
zpe.correction: 0.253360 hartree
zpe.thermalcorrener: 0.270280 hartree
zpe.thermalcorrenthalpy: 0.271225 hartree
zpe.thermalcorrgfe: 0.208074 hartree
zpe.sumelectzpe: -943.863809 hartree
zpe.sumelectthermal: -943.846889 hartree
zpe.sumelectthermalent: -943.845945 hartree
zpe.sumelectthermalfe: -943.909095 hartree
dipole: 0.0573 6.4147 -0.4221
dipole: 6.4288
quadrupole: -95.5313 -135.5371 -124.2217
quadrupole: 9.2685 -5.5437 -3.1528
quadrupole: 22.8987 -17.1071 -5.7917 9.2685 -5.5437 -3.1528
hfenergy: -944.1171691 hartree
pointgroup: C01 [X(C16H12N6)]
dipole: -0.2563329 -2.4178175 0.6969536 debye
polarizability: 335.9324907|-3.6469123|230.421417|26.3805127|-45.7501425|138.0638669 unknown
InChI: InChI=1S/C16H12N6/c17-15-18-16-20-19-13(11-7-3-1-4-8-11)14(22(16)21-15)12-9-5-2-6-10-12/h1-10H,17H2
charge 0 multiplicity 1
34 atoms
N  1.848023 0.215095 0.054033
N  0.313063 2.351418 -0.766366
N  2.846606 -0.680564 0.409145
N  1.66025 2.518602 -0.774452
N  3.779095 1.405946 -0.180704
N  5.228943 -0.384595 0.516746
C  0.488184 -0.019213 -0.039275
C  -0.272768 1.142484 -0.379076
C  -0.036869 -1.397617 0.122083
C  -1.761135 1.201388 -0.330346
C  2.428967 1.485669 -0.316802
C  -0.994622 -1.88989 -0.80772
C  0.407802 -2.247457 1.171258
C  -2.503889 0.554229 0.694368
C  -2.453409 1.991607 -1.287022
C  3.984337 0.111426 0.250949
C  -1.503421 -3.197957 -0.682975
C  -0.120386 -3.548563 1.30338
C  -1.07465 -4.03047 0.377718
C  -3.908262 0.677225 0.744339
C  -3.858273 2.109008 -1.236989
C  -4.59268 1.448665 -0.224227
H  -1.333241 -1.249595 -1.628155
H  1.164604 -1.891312 1.874759
H  -1.986087 -0.032626 1.459812
H  -1.873546 2.518715 -2.050469
H  -2.23319 -3.566404 -1.411719
H  0.221396 -4.189905 2.122872
H  -1.475869 -5.045042 0.477804
H  -4.4673 0.178181 1.543602
H  -4.378844 2.7181 -1.98416
H  -5.683823 1.540951 -0.184162
H  5.343419 -1.349315 0.812746
H  6.035075 0.221113 0.393404
