program: Gaussian 09
title: 000283692
version: EM64L-G09RevD.01
frameworkgroup: C1[X(C13H7N3O)]
method: RPBEPBE
basis: SDD
operation: Freq
keyword: #p
keyword: freq=noraman
keyword: PBEPBE/SDD
title: #p freq=noraman PBEPBE/SDD
converged: NO NO NO NO
title: Mulliken charges:
elementType: O N N N C C C C C C C C C C C C C H H H H H H H
charge: -0.220219 -0.324009 -0.034746 -0.077149 0.057811 0.369185 0.256584 0.141778 0.009253 0.034803 -0.389924 -0.346482 -0.351542 -0.296620 -0.196368 -0.206361 -0.251420 0.275202 0.285007 0.283287 0.263120 0.238468 0.240136 0.240206
chargesum: 0.00000
title: Mulliken charges with hydrogens summed into heavy atoms:
elementType: O N N N C C C C C C C C C C C C C
charge: -0.220219 -0.324009 -0.034746 -0.077149 0.057811 0.369185 0.256584 0.141778 0.009253 0.034803 -0.114722 -0.061476 -0.068255 -0.033499 0.042100 0.033775 -0.011214
polarizability: 2.55201767e+02 9.78377224e-01 1.85814263e+02 -1.13557037e-03 1.15303948e-02 6.03831813e+01
1716.lowfreq: -9.0121 -8.7855 -0.0006 -0.0003 0.0004 12.1254 73.2732 115.8065 140.9527
frequency: 73.2712 115.7954 140.9489 216.0605 224.3979 246.8679 306.2402 323.9360 368.7458 400.3884 418.7837 445.1552 490.9165 522.1791 535.5160 582.7041 588.7436 636.9989 637.7094 655.2886 698.0893 707.7832 738.2476 778.8986 792.1564 818.6112 831.1247 888.8365 902.9031 921.2338 947.2853 982.1335 983.9882 994.3521 1007.2536 1008.1759 1028.4839 1044.6024 1097.4465 1163.6844 1171.0961 1182.6681 1187.6476 1211.5980 1255.5874 1273.6184 1283.1815 1378.1703 1379.8754 1418.9481 1435.9340 1458.6735 1476.2387 1492.0891 1551.4112 1569.2935 1608.6063 1622.6204 1651.2897 3141.5632 3148.7889 3153.2623 3166.4724 3167.3257 3178.7877 3181.8382
redmass: 6.1969 5.6378 6.0674 5.6272 5.7117 4.6229 8.5857 6.5602 7.1891 9.3862 3.7834 8.0997 4.5000 3.6240 9.0113 3.7586 7.7577 8.7183 6.5668 6.5409 4.3891 7.5830 4.1642 1.5982 1.5691 8.2036 2.4647 7.2437 1.4781 8.6710 1.4255 8.8276 1.3748 1.3612 4.8362 1.3413 2.1150 1.8691 2.3198 1.6606 1.5114 1.8654 2.0959 3.2608 4.2315 1.6509 2.1814 3.1439 4.5347 5.6418 3.0510 2.7319 3.2712 6.1361 9.3928 7.0556 8.3448 7.3941 10.0241 1.0864 1.0877 1.0907 1.0934 1.0959 1.0992 1.0976
irintensity: 6.9822 1.6050 0.5201 0.9086 0.0490 0.2843 7.3478 0.0559 0.9996 5.0145 0.1604 9.2496 5.4334 0.6963 3.3043 3.5567 16.6609 8.2448 1.3969 3.0223 15.2527 0.5950 2.6209 115.1060 2.4186 39.9580 30.2452 35.9276 0.4343 90.7715 0.0089 31.8008 3.8024 1.7767 9.2059 0.1678 1.5331 8.9041 34.5534 7.2279 30.2657 31.7549 27.0388 6.4846 6.8317 9.5292 97.4069 9.9572 2.7538 54.5078 8.8325 5.3418 42.8963 89.1294 145.7349 42.8519 64.3846 41.1291 17.6991 3.8292 4.4603 3.4466 4.1278 14.1420 10.3941 11.3758
temp: 298.150 k
press: 1.00000 atm
elementType: 8 7 7 7 6 6 6 6 6 6 6 6 6 6 6 6 6 1 1 1 1 1 1 1
symmnumber: 1
zpe: 448674.5 jmol-1
zpe.correction: 0.170891 hartree
zpe.thermalcorrener: 0.182127 hartree
zpe.thermalcorrenthalpy: 0.183071 hartree
zpe.thermalcorrgfe: 0.133742 hartree
zpe.sumelectzpe: -737.919254 hartree
zpe.sumelectthermal: -737.908019 hartree
zpe.sumelectthermalent: -737.907075 hartree
zpe.sumelectthermalfe: -737.956403 hartree
dipole: -0.4318 0.3115 0.0002
dipole: 0.5324
quadrupole: -71.0203 -111.8382 -99.5958
quadrupole: 10.9877 0.0016 -0.0023
quadrupole: 23.1312 -17.6868 -5.4444 10.9877 0.0016 -0.0023
hfenergy: -738.0901453 hartree
pointgroup: C01 [X(C13H7N3O1)]
dipole: 0.1697844 0.1226606 -0.0000625 debye
dipolederiv: -0.5791382 -0.0798137 -0.0000212 -0.1104983 -1.1133726 -0.0000751 0.0000003 0.000248 -0.3244982 -0.9005967 -0.1453776 0.00012 -0.5440918 -0.7048328 0.0000954 -0.0000316 -0.0000137 0.0239429 0.499364 0.8049941 -0.0002614 0.7319901 0.3970004 0.0001784 -0.000354 -0.0001515 -0.1427292 -0.7583004 -0.5715279 0.0000112 0.0759991 0.2451317 -0.0002145 0.0003925 0.0001734 -0.1756381 0.1655109 -0.2316189 0.0000381 -0.252575 -0.0123035 0.0000133 -0.0001784 -0.0000182 0.055983 -0.7382279 -0.3202835 -0.000003 0.0734207 -0.063195 0.0000184 -0.0000448 -0.0000186 0.0244521 1.0583953 0.2263012 -0.0000102 0.0225675 0.168882 0.0000199 0.0001216 -0.0000656 0.1112186 -0.4090324 0.3546999 -0.0000222 0.1597368 -0.3699433 0.0000258 -0.0000968 -0.00002 -0.0282744 -0.070839 0.1327381 0.0000598 -0.2862419 -0.2480966 -0.0000401 0.0000228 -0.000006 0.0714519 1.3490296 -0.0121386 0.0000553 0.0123497 1.2489792 0.0000138 0.0000965 -0.0001873 0.1556842 0.3536575 0.2935516 0.0000291 -0.0744105 0.1345921 -0.000027 0.0000408 0.0000139 -0.0988824 -0.474717 -0.0304226 0.0000103 0.1132268 0.0564508 -0.0000082 0.0000567 0.0000148 -0.1527414 -0.0226988 -0.1877632 -0.0000098 0.134487 0.0921564 -0.0000038 -0.000018 0.0000082 -0.0969668 0.1183782 -0.13917 0.00002 0.2204682 0.3401414 -0.0000342 -0.0000491 -0.0000316 -0.1007245 -0.0356796 -0.2554067 0.0000513 -0.3205961 -0.3480573 -0.000015 0.0000872 0.0000656 -0.1626052 0.2196115 -0.0155283 -0.0000341 0.003322 0.1720089 -0.0000036 -0.0000325 -0.0000133 -0.1254897 0.0929938 0.1617295 -0.000043 0.0287108 -0.2205213 -0.0000068 -0.0000426 -0.000021 -0.1608801 0.1126409 -0.0179315 -0.0000056 0.0278683 -0.0058725 0.0000165 -0.0000397 0.000012 0.1528027 0.1069209 -0.05385 0.0000086 -0.016278 0.0069377 0.0000072 -0.000003 0.0000031 0.1758378 0.1290615 0.0198459 0.0000048 -0.0585758 0.0107246 0.0000043 0.0000383 -0.0000018 0.1523479 -0.0060153 -0.0432328 -0.0000032 -0.0695181 0.0745054 0.0000112 0.0000219 -0.0000042 0.1666834 -0.0740248 0.074462 -0.0000308 0.0901767 0.0465426 0.0000172 -0.0000374 -0.0000012 0.1608452 -0.0371253 0.0907371 0.0000119 0.1053803 0.0234718 -0.0000056 0.0000214 -0.0000024 0.1546602 -0.0991688 -0.0549944 0.000024 -0.0669186 0.0686699 0.0000126 0.000028 0.0000175 0.1635202 unknown
polarizability: 255.2031709|-0.927254|185.8128587|-0.0011271|-0.0115312|60.3831813 unknown
InChI: InChI=1S/C13H7N3O/c17-13-8-4-1-2-7-11(8)16-12-9(13)5-3-6-10(12)14-15-16/h1-7H
charge 0 multiplicity 1
24 atoms
O  0.528811 2.990083 -0.00038
N  -0.060677 -1.143374 0.000111
N  -0.562797 -2.502635 -0.000164
N  -1.898798 -2.416805 0.000564
C  -1.108951 -0.267083 0.000014
C  -1.037752 1.135514 -0.000112
C  1.275813 -0.685947 0.000081
C  1.463487 0.739532 0.000016
C  -2.288026 -1.044299 0.000023
C  0.324131 1.734797 0.000107
C  -2.290675 1.794699 -0.000372
C  2.368647 -1.580068 -0.000012
C  2.794867 1.229388 -0.000156
C  -3.533797 -0.376392 -0.000239
C  -3.504954 1.043966 -0.000434
C  3.675495 -1.055549 -0.000151
C  3.89134 0.348104 -0.000225
H  -2.314816 2.88929 -0.00047
H  2.181196 -2.657239 0.000019
H  2.930326 2.316113 -0.00021
H  -4.479912 -0.925203 -0.000186
H  -4.455101 1.588015 -0.000563
H  4.530207 -1.740322 -0.000217
H  4.912237 0.743017 -0.000344
