program: Gaussian 09
title: 000283680
version: EM64L-G09RevD.01
frameworkgroup: C1[X(C8H10O2)]
method: RPBEPBE
basis: SDD
operation: Freq
keyword: #pfreq=noraman
keyword: PBEPBE/SDD
title: #p freq=noraman PBEPBE/SDD
converged: NO YES NO NO
title: Mulliken charges:
elementType: O O C C C C C C C C H H H H H H H H H H
charge: -0.422027 -0.261196 -0.195994 -0.196041 -0.290951 -0.448486 -0.448495 0.170558 -0.206486 -0.206481 0.274286 0.274446 0.284624 0.222766 0.215396 0.215437 0.222789 0.210150 0.210154 0.375549
chargesum: 0.00000
title: Mulliken charges with hydrogens summed into heavy atoms:
elementType: O O C C C C C C C C
charge: -0.046477 -0.261196 0.078291 0.078405 -0.006327 -0.010323 -0.010269 0.170558 0.003664 0.003673
polarizability: 1.00757465e+02 -2.90496403e-02 8.40061820e+01 6.50356299e-01 -7.65953806e-03 7.27109841e+01
1716.lowfreq: -21.5334 -6.3980 -0.0003 -0.0002 0.0002 7.2736 60.8115 90.8536 140.4719
frequency: 60.8030 90.8293 140.4593 173.4652 265.9696 296.2134 387.3760 413.7264 523.0485 527.9668 586.3208 600.1958 667.3018 685.4181 774.2772 782.1259 833.6070 879.8052 894.0655 925.3639 959.9939 968.0471 986.4462 1013.6440 1042.6441 1052.2500 1083.4039 1086.5377 1120.0288 1175.9587 1203.2745 1204.5057 1211.0149 1232.4184 1324.4697 1326.0713 1346.3432 1352.5802 1386.1772 1437.1113 1457.4552 1461.2894 1647.2850 1681.2681 2956.4997 2956.8277 2999.4628 3000.0385 3100.2995 3121.1311 3130.7765 3135.0351 3167.4912 3511.5289
redmass: 6.5809 3.0753 4.3085 3.0090 4.5410 2.5956 1.9644 4.6311 5.5471 5.2364 1.3299 4.1847 1.1710 3.3365 4.3335 4.4887 2.1059 2.5828 2.6896 2.6333 3.2631 1.6554 1.6593 2.5341 1.4069 1.4935 1.4070 1.6055 1.1603 1.1260 1.1607 1.1612 1.2818 1.2785 2.5360 1.2802 2.3554 1.7124 1.5359 2.5000 1.0736 1.2347 8.0353 6.4297 1.0618 1.0621 1.0971 1.0969 1.0840 1.0880 1.0963 1.0952 1.0901 1.0639
irintensity: 2.1718 0.9175 0.0453 0.9377 4.9823 0.1757 0.5031 18.4232 1.3751 1.2505 100.0242 22.6174 65.2912 65.2568 2.0288 23.7875 3.0423 0.4722 1.5899 7.8834 20.7190 0.1775 1.3871 17.8824 10.0414 149.5182 0.6706 208.5392 6.2486 7.0453 1.2282 17.3200 10.1685 2.1092 50.0735 0.2213 0.3152 38.0287 0.2778 76.0790 18.6893 12.3926 247.2752 3.0950 14.5334 65.7601 19.9722 30.1816 7.0590 6.8752 61.0819 4.4100 1.2147 26.0684
temp: 298.150 k
press: 1.00000 atm
elementType: 8 8 6 6 6 6 6 6 6 6 1 1 1 1 1 1 1 1 1 1
symmnumber: 1
zpe: 426753.7 jmol-1
zpe.correction: 0.162542 hartree
zpe.thermalcorrener: 0.171544 hartree
zpe.thermalcorrenthalpy: 0.172488 hartree
zpe.thermalcorrgfe: 0.128063 hartree
zpe.sumelectzpe: -460.512007 hartree
zpe.sumelectthermal: -460.503006 hartree
zpe.sumelectthermalent: -460.502062 hartree
zpe.sumelectthermalfe: -460.546487 hartree
dipole: 1.6642 0.0018 0.7576
dipole: 1.8285
quadrupole: -56.4166 -54.9587 -62.6319
quadrupole: -0.0165 -4.2142 -0.0039
quadrupole: 1.5858 3.0437 -4.6295 -0.0165 -4.2142 -0.0039
hfenergy: -460.6745494 hartree
pointgroup: C01 [X(C8H10O2)]
dipole: -0.6612208 -0.0009144 0.2833807 debye
dipolederiv: -0.6690288 0.0015184 -0.5503732 0.0030507 -0.4104422 0.0047632 -0.5662228 0.0020318 -0.9953203 -0.8942445 -0.0012637 0.2247137 0.0009493 -0.3403839 -0.0003106 0.2028415 0.0029601 -0.8506112 0.2709116 -0.0395305 0.0326631 0.1222505 -0.0017405 0.0836785 0.2635941 -0.0078891 0.1361801 0.2712864 0.0398602 0.0338564 -0.1230731 -0.001053 -0.0841056 0.2648666 0.0072614 0.136284 -0.9823711 0.000838 -0.2281627 -0.001002 -0.05832 -0.0002017 -0.430567 0.0000796 -0.1642196 0.0507078 0.00137 0.1040359 -0.0279081 0.0437869 0.0536695 0.049285 0.1064091 0.1006083 0.0503355 -0.0020149 0.1039773 0.0274629 0.0446365 -0.0536986 0.0487224 -0.106575 0.0996975 1.885309 -0.001311 0.2870899 -0.0022511 0.1971425 -0.0047964 0.1500823 -0.0051553 1.4014718 0.0090913 0.0514946 -0.1921946 0.0869899 0.0505694 -0.0384392 -0.2186054 -0.1156638 -0.0948292 0.0094348 -0.0504867 -0.1925119 -0.0858791 0.0494808 0.0388809 -0.2192762 0.1161324 -0.0940563 -0.0259354 -0.0286859 0.0814561 -0.0009143 0.0277849 0.0558536 0.0336394 0.0729164 0.0158939 -0.0259364 0.0281619 0.0815302 0.0008197 0.0285756 -0.0555776 0.0335766 -0.0727004 0.0152997 0.0374788 -0.0000709 0.035292 -0.0003638 0.1049496 0.0003001 0.0205573 0.0002275 -0.0218857 -0.040694 0.0315494 -0.068885 0.0517667 0.0234283 0.0727722 -0.0481845 0.1372637 -0.0587916 0.024062 -0.076223 -0.0122192 -0.0279437 -0.1003286 -0.0811839 0.007586 -0.1431265 0.0111599 0.0239926 0.0764013 -0.0118746 0.0281129 -0.1013433 0.0805447 0.007606 0.1424712 0.0124132 -0.0406717 -0.0311698 -0.0689346 -0.0515679 0.0245749 -0.0723635 -0.0480041 -0.1367833 -0.0598594 -0.0504876 0.0593587 0.1281552 0.0752754 0.0146639 -0.0496973 0.15053 -0.0495361 0.0675172 -0.0503059 -0.0601088 0.1277504 -0.0761717 0.0139492 0.0495863 0.1500569 0.0494331 0.0680778 0.1470654 0.0003127 0.0846355 0.0003967 0.3900691 0.0003256 0.147916 0.0002431 0.2749698 unknown
polarizability: 100.7724995|-0.03403|84.0061563|-0.0239368|0.0233878|72.6959758 unknown
InChI: InChI=1S/C8H10O2/c9-8(10)7-5-3-1-2-4-6(5)7/h1-2,5-7,9H,3-4H2
charge 0 multiplicity 1
20 atoms
O  2.772294 -0.005777 1.407926
O  2.71539 0.00115 -0.915365
C  -0.224261 0.762307 -0.700935
C  -0.223212 -0.757083 -0.704931
C  0.628534 0.000453 0.356183
C  -1.455531 1.531061 -0.227926
C  -1.453497 -1.530045 -0.236259
C  2.092483 0.002301 0.176854
C  -2.455057 0.677019 0.530091
C  -2.454189 -0.681491 0.526368
H  0.374144 1.244665 -1.482042
H  0.375864 -1.23447 -1.488573
H  0.268177 -0.002539 1.387451
H  -1.958802 1.968604 -1.116489
H  -1.148412 2.395233 0.39562
H  -1.145312 -2.397211 0.382585
H  -1.956181 -1.963377 -1.127217
H  -3.229901 1.212734 1.09496
H  -3.22833 -1.221298 1.088296
H  3.752099 -0.008235 1.228999
