program: Gaussian 09
title: 000285254
version: EM64L-G09RevD.01
frameworkgroup: C1[X(C11H15N3O4)]
method: RPBEPBE
basis: SDD
operation: Freq
keyword: #p
keyword: freq=noraman
keyword: PBEPBE/SDD
title: #p freq=noraman PBEPBE/SDD
converged: YES YES NO NO
title: Mulliken charges:
elementType: O O O O N N N C C C C C C C C C C C H H H H H H H H H H H H H H H
charge: -0.278884 -0.274257 -0.277851 -0.268575 -0.425753 -0.079220 -0.623238 -0.153106 -0.129532 -0.181114 0.341481 -0.349743 0.404914 -0.686132 -0.692551 -0.495204 0.049433 0.150196 0.258697 0.249704 0.278542 0.255710 0.216657 0.219005 0.218433 0.270393 0.241208 0.220768 0.220398 0.288006 0.352301 0.347859 0.331457
chargesum: 0.00000
title: Mulliken charges with hydrogens summed into heavy atoms:
elementType: O O O O N N N C C C C C C C C C C C
charge: -0.278884 -0.274257 -0.277851 -0.268575 -0.073451 -0.079220 0.056078 0.105591 0.120172 0.097427 0.341481 0.122624 0.404914 0.021698 -0.010178 -0.207198 0.049433 0.150196
polarizability: 2.05341491e+02 -9.01178513e-01 1.37338742e+02 -9.83283069e+00 -2.72108129e-01 1.00350062e+02
1716.lowfreq: -5.4532 -4.0373 0.0005 0.0007 0.0008 2.2457 25.5904 42.6290 58.9109
frequency: 25.3319 42.5853 58.9053 72.7051 97.5428 107.7215 143.0076 165.3238 178.4321 220.7372 240.5043 255.1765 278.5028 311.4810 335.3675 361.1969 372.4517 404.5761 456.4896 479.9108 513.9440 540.4876 582.5124 608.0132 621.0597 625.0046 641.7538 653.4865 699.3920 715.9983 725.2438 726.7961 762.4579 799.8546 825.7851 841.4301 855.5021 869.7657 883.5655 924.3509 936.5825 959.3241 961.7583 986.8363 1002.5983 1016.2777 1025.6043 1046.1047 1062.9229 1075.7927 1107.1747 1139.2222 1141.2623 1183.6031 1189.2349 1206.6251 1229.1119 1255.6122 1259.7353 1267.1451 1270.3966 1292.7381 1314.6032 1328.2417 1332.3675 1368.3286 1379.2868 1392.3192 1405.0231 1451.6620 1453.5014 1457.7893 1470.9246 1478.5424 1483.2778 1545.5184 1582.0047 1632.6308 2972.1762 2990.6065 3006.8673 3043.5070 3061.2765 3080.7935 3094.0947 3098.6813 3109.6258 3112.3561 3120.2823 3246.9431 3509.6978 3588.9477 3674.2840
redmass: 4.8110 5.3131 5.2831 4.7296 4.9425 4.1111 5.0050 1.0766 5.2093 2.8944 1.0965 7.0689 3.8376 4.7602 2.8396 3.9025 2.9333 2.7041 7.0575 3.9398 4.4333 1.4031 5.0547 1.2367 4.8054 4.4445 2.5310 4.5844 5.3283 4.1904 1.1694 5.9091 5.0230 4.6808 3.7916 4.0688 3.0841 1.8732 2.9007 1.6134 2.7805 4.3753 2.5597 1.3146 5.3556 3.2988 3.4018 2.7514 1.9478 2.5825 1.7645 1.8825 3.1229 1.4005 1.4797 2.6343 1.4590 1.4551 3.1669 1.7205 1.4595 3.3599 1.2561 1.3621 1.3012 2.6652 1.2745 1.2266 6.0160 1.0535 1.0783 1.0528 1.0638 5.1505 1.0483 4.9503 1.4650 4.4252 1.0679 1.0351 1.0355 1.0855 1.0877 1.0890 1.0998 1.1013 1.0996 1.0975 1.1010 1.0997 1.0450 1.0821 1.1045
irintensity: 0.6785 4.7453 1.6040 1.4659 4.1240 4.1254 11.6770 0.8961 8.2643 2.5864 0.8252 6.2738 4.3764 0.2756 4.6026 2.8394 0.4131 5.5929 20.0745 13.1070 0.0938 129.7460 1.7934 139.6262 3.7393 2.6201 3.7983 7.5741 29.3523 20.7583 101.3103 9.3054 20.2088 28.7876 32.5043 21.3434 10.4326 39.9699 2.8277 2.0657 30.3730 24.3999 24.5859 0.6593 78.4955 34.0816 69.7938 37.7587 0.7365 29.4026 11.3647 34.4849 12.6249 19.3548 43.5725 87.7793 22.7227 5.4991 95.3527 25.8856 32.7188 93.1901 4.4085 19.5335 5.2584 1.2993 40.9029 36.5020 35.0691 6.9973 3.9739 8.1826 0.2900 47.6509 12.1980 12.7275 184.5402 279.2636 48.2003 16.6608 14.7695 6.2221 14.6501 34.8491 7.3375 5.6815 21.6521 15.3295 19.8230 3.6388 40.7045 92.8309 52.2053
temp: 298.150 k
press: 1.00000 atm
elementType: 8 8 8 8 7 7 7 6 6 6 6 6 6 6 6 6 6 6 1 1 1 1 1 1 1 1 1 1 1 1 1 1 1
symmnumber: 1
zpe: 684420.5 jmol-1
zpe.correction: 0.260682 hartree
zpe.thermalcorrener: 0.277344 hartree
zpe.thermalcorrenthalpy: 0.278288 hartree
zpe.thermalcorrgfe: 0.215437 hartree
zpe.sumelectzpe: -891.947374 hartree
zpe.sumelectthermal: -891.930712 hartree
zpe.sumelectthermalent: -891.929768 hartree
zpe.sumelectthermalfe: -891.992618 hartree
dipole: 1.9118 -3.5693 0.4375
dipole: 4.0726
quadrupole: -102.7904 -111.1125 -105.1424
quadrupole: 14.9916 -2.8500 -0.8604
quadrupole: 3.5581 -4.7641 1.2060 14.9916 -2.8500 -0.8604
hfenergy: -892.2080559 hartree
pointgroup: C01 [X(C11H15N3O4)]
dipole: 0.7090759 -0.3960775 -1.3811945 debye
polarizability: 205.3042111|8.838439|101.1803464|-4.3713826|5.7384827|136.5457383 unknown
InChI: InChI=1S/C11H15N3O4/c1-11(2)17-7-4-16-8(9(7)18-11)5-3-6(10(12)15)14-13-5/h3,7-9,13H,4,12H2,1-2H3
charge 0 multiplicity 1
33 atoms
O  2.583882 0.8802 1.138391
O  3.445067 -1.092844 0.178718
O  1.050031 0.115245 -1.649347
O  -4.460644 0.283192 2.272206
N  -1.691943 0.3037 -1.369906
N  -3.032626 0.151416 -1.088923
N  -5.487575 -0.024025 0.193206
C  1.413576 0.088609 0.75538
C  1.983529 -1.236466 0.130288
C  0.575944 0.738917 -0.381501
C  3.79715 0.324864 0.469624
C  1.402501 -1.285686 -1.296825
C  -0.912431 0.511847 -0.239873
C  4.105106 1.089551 -0.825882
C  4.937576 0.332556 1.483566
C  -1.801077 0.505092 0.846787
C  -3.093492 0.282229 0.278665
C  -4.391617 0.182992 1.008569
H  0.818876 -0.070294 1.667942
H  1.734306 -2.139541 0.710726
H  0.816781 1.813291 -0.460168
H  2.13531 -1.636699 -2.03842
H  0.493632 -1.921697 -1.322641
H  4.316425 2.147819 -0.592792
H  4.993862 0.651884 -1.313229
H  3.254011 1.038316 -1.52594
H  4.637262 -0.218147 2.388972
H  5.830663 -0.147955 1.049449
H  5.191435 1.369903 1.760227
H  -1.589699 0.651237 1.902716
H  -1.343986 0.232212 -2.326277
H  -5.363724 -0.094758 -0.817433
H  -6.411011 -0.102858 0.614826
