program: Gaussian 09
title: 000285239
version: EM64L-G09RevD.01
frameworkgroup: C1[X(C9H12N6O4)]
method: RPBEPBE
basis: SDD
operation: Freq
keyword: #p
keyword: freq=noraman
keyword: PBEPBE/SDD
title: #p freq=noraman PBEPBE/SDD
converged: YES YES NO NO
title: Mulliken charges:
elementType: O O O O N N N N N N C C C C C C C C C H H H H H H H H H H H H
charge: -0.249088 -0.439947 -0.451223 -0.427325 -0.126504 -0.052081 -0.104086 -0.144642 -0.086725 -0.613174 -0.199827 -0.135367 -0.120256 -0.114098 -0.372492 0.182469 0.007512 -0.353164 0.220718 0.266713 0.294435 0.284132 0.254357 0.211892 0.262964 0.353142 0.350886 0.278572 0.336724 0.333781 0.351702
chargesum: 0.00000
title: Mulliken charges with hydrogens summed into heavy atoms:
elementType: O O O O N N N N N N C C C C C C C C C
charge: -0.249088 -0.086806 -0.100337 -0.090601 -0.126504 -0.052081 -0.104086 -0.144642 -0.086725 0.072309 0.066886 0.159068 0.163876 0.140259 0.102364 0.182469 0.007512 -0.074591 0.220718
polarizability: 2.29434196e+02 -2.70248537e+00 1.50968700e+02 4.63196357e+00 -2.53819349e+00 9.13912907e+01
1716.lowfreq: -8.2957 -1.8377 -0.0005 0.0003 0.0005 5.9975 31.2570 39.3023 65.0165
frequency: 31.2043 39.2827 65.0138 92.3728 123.1105 131.5171 142.7480 180.4252 193.2568 217.4583 229.4983 256.0853 265.2409 273.2123 303.9079 316.1185 355.2757 370.7717 418.4837 449.6202 457.4862 507.5322 513.6731 530.7266 558.3826 579.5951 623.4432 642.7303 667.2850 672.5845 701.0310 720.6487 758.0019 778.5989 795.1342 835.5100 841.3183 876.7021 883.1986 912.0078 915.0014 951.6432 965.1541 972.8284 993.0829 1009.7921 1024.2678 1036.5991 1053.2490 1056.8321 1083.5835 1125.7180 1146.9405 1164.4230 1198.1570 1216.5169 1230.7889 1240.9211 1263.3163 1274.7626 1287.9285 1298.3476 1318.5862 1339.6193 1348.6211 1364.5401 1376.8247 1379.6105 1404.4193 1444.1003 1456.5421 1475.6093 1478.7605 1589.5482 1635.0009 2990.0152 3021.9205 3026.4027 3054.3989 3103.9884 3112.2855 3217.5326 3225.3490 3529.4432 3557.0962 3564.3515 3685.1407
redmass: 7.2706 6.3195 6.9093 5.0190 5.2786 5.3617 4.4525 7.4835 7.2595 4.7513 3.1132 1.4891 4.2997 4.7248 1.9803 2.8694 3.0252 2.9530 5.2312 1.1386 5.8041 7.4340 5.4506 4.8585 7.0111 1.4534 7.7296 3.6568 7.7420 8.4742 4.6449 1.2255 5.0554 4.8507 6.2754 2.6277 1.5526 3.7846 8.6916 3.4675 2.7775 2.7193 7.2517 3.9484 7.0244 3.8459 4.2504 4.1925 3.1193 2.7268 1.6547 3.4396 1.3847 1.3852 1.9710 1.8106 2.5867 1.3136 4.0810 1.4592 1.2017 1.2767 1.3307 1.7506 1.3796 3.4078 1.4443 1.5496 2.5177 3.4861 1.3086 1.1010 6.2228 2.0105 2.2957 1.0674 1.0856 1.0879 1.0871 1.0876 1.0982 1.0704 1.0967 1.0457 1.0663 1.0668 1.1040
irintensity: 1.7526 5.7246 3.6680 3.7153 2.7760 5.4983 8.4729 1.7088 3.1696 3.6903 25.9572 85.4633 5.4050 28.7836 133.9705 19.2147 61.2778 15.7073 14.3971 105.0705 11.5716 0.1475 12.2646 13.9452 0.9456 133.1995 1.1084 45.1592 8.6333 15.4290 27.9952 89.9183 32.9453 21.0369 85.5343 30.8179 16.5837 15.8683 11.6551 52.1595 23.0386 7.1173 5.5440 316.4503 191.3228 128.8493 86.6002 30.3417 23.6894 23.8381 7.1075 4.4256 23.2313 7.6441 1.7183 34.0686 3.9911 9.3336 20.5432 7.5909 2.3046 25.0932 6.5152 53.9818 12.8668 26.7306 2.8382 2.7591 66.5796 0.9798 61.0657 5.2289 62.5133 27.2444 474.6308 48.8956 36.1786 16.0031 4.3202 24.8567 9.0967 606.4514 51.8337 143.4899 8.1070 11.4854 41.4370
temp: 298.150 k
press: 1.00000 atm
elementType: 8 8 8 8 7 7 7 7 7 7 6 6 6 6 6 6 6 6 6 1 1 1 1 1 1 1 1 1 1 1 1
symmnumber: 1
zpe: 601241.6 jmol-1
zpe.correction: 0.229001 hartree
zpe.thermalcorrener: 0.246048 hartree
zpe.thermalcorrenthalpy: 0.246992 hartree
zpe.thermalcorrgfe: 0.183956 hartree
zpe.sumelectzpe: -978.039609 hartree
zpe.sumelectthermal: -978.022562 hartree
zpe.sumelectthermalent: -978.021618 hartree
zpe.sumelectthermalfe: -978.084653 hartree
dipole: -4.7705 4.7912 0.0561
dipole: 6.7614
quadrupole: -113.6105 -113.7827 -106.3661
quadrupole: -29.5164 -7.0936 -10.6036
quadrupole: -2.3574 -2.5296 4.8870 -29.5164 -7.0936 -10.6036
hfenergy: -978.2686097 hartree
pointgroup: C01 [X(C9H12N6O4)]
dipole: -1.7405505 -1.1798495 -1.6293338 debye
polarizability: 228.4073752|10.7970674|114.7159252|2.2363894|29.3712683|128.6708858 unknown
InChI: InChI=1S/C9H12N6O4/c10-7-3-1-11-15(8(3)13-14-12-7)9-6(18)5(17)4(2-16)19-9/h1,4-6,9,16-18H,2,10H2
charge 0 multiplicity 1
31 atoms
O  1.681473 -0.542704 1.101625
O  2.610711 2.340459 0.349136
O  2.445909 -0.417969 -2.090306
O  5.428324 -0.632574 0.692384
N  -0.300945 0.038087 -0.140645
N  -0.214594 -0.744966 -1.296908
N  -2.065856 0.825788 1.383498
N  -4.271512 0.069821 0.770024
N  -3.423516 0.777254 1.597729
N  -4.75361 -1.283379 -1.067359
C  1.861111 1.336504 -0.408692
C  2.87842 0.256993 -0.875409
C  0.905666 0.555759 0.544583
C  2.975465 -0.689245 0.346066
C  4.125911 -0.361653 1.317785
C  -1.611954 0.127675 0.291061
C  -2.405436 -0.623844 -0.629365
C  -1.477261 -1.141841 -1.592472
C  -3.801746 -0.631375 -0.335858
H  1.324935 1.78074 -1.268664
H  3.851543 0.714265 -1.105367
H  0.517282 1.173516 1.373545
H  3.032831 -1.739522 0.002874
H  3.989181 -0.937667 2.255138
H  4.133243 0.714083 1.549121
H  2.030581 3.1162 0.555081
H  1.491881 -0.72103 -1.966184
H  -1.64606 -1.763157 -2.469682
H  5.512902 -1.604741 0.520668
H  -4.525235 -1.835192 -1.890204
H  -5.721943 -1.212284 -0.753799
