program: Gaussian 09
title: 000024154
version: EM64L-G09RevD.01
frameworkgroup: C1[X(C6H13NO5)]
method: RPBEPBE
basis: SDD
operation: Freq
keyword: #p
keyword: freq=noraman
keyword: PBEPBE/SDD
title: #p freq=noraman PBEPBE/SDD
converged: YES YES NO NO
title: Mulliken charges:
elementType: O O O O O N C C C C C C H H H H H H H H H H H H H
charge: -0.262639 -0.430421 -0.423831 -0.430986 -0.454763 -0.631549 -0.116816 -0.155565 -0.088017 -0.037885 -0.103494 -0.378751 0.203706 0.243263 0.248275 0.228813 0.199159 0.217832 0.209697 0.264785 0.299862 0.343212 0.341579 0.365526 0.349008
chargesum: 0.00000
title: Mulliken charges with hydrogens summed into heavy atoms:
elementType: O O O O O N C C C C C C
charge: -0.262639 -0.087209 -0.082252 -0.065459 -0.105754 -0.066903 0.086890 0.087698 0.160258 0.190928 0.095664 0.048778
polarizability: 1.02590940e+02 4.27727946e-01 8.96599602e+01 -2.52374831e+00 4.32877575e-01 7.14242313e+01
1716.lowfreq: -14.0227 -0.8596 -0.0012 -0.0012 -0.0011 16.7782 60.7246 70.6347 93.4801
frequency: 60.6336 70.4970 93.4253 120.2394 148.8372 191.8133 211.7552 222.9524 247.9120 250.7760 263.3434 311.6333 334.4755 366.7673 377.1733 405.5891 428.2525 436.9531 486.0905 506.3800 575.8613 665.7305 746.6545 755.3249 834.1454 842.8319 922.6834 943.3418 967.6870 974.2656 995.5498 1020.1837 1029.9120 1071.8256 1085.9894 1097.8208 1136.6168 1170.7132 1183.4861 1212.0889 1222.3571 1238.5739 1242.0446 1248.5521 1268.4159 1295.0463 1310.9326 1334.9893 1344.0888 1370.2350 1378.6502 1399.0671 1414.8449 1422.9917 1457.7729 1640.7317 2914.6326 2928.5599 2949.2634 2966.2512 2971.9752 3033.3173 3063.9340 3439.7282 3510.0780 3557.1644 3564.7755 3569.1996 3581.6462
redmass: 3.1344 3.8721 3.9144 3.1173 1.7006 2.6076 1.7347 2.3600 3.8622 3.6444 3.7268 4.9578 1.3798 1.8748 1.5960 2.3696 1.5674 3.8262 3.6929 3.6247 3.9500 3.7908 2.0625 2.1405 4.0171 3.0228 2.4876 2.7557 4.7089 4.1934 3.5239 3.5290 2.7405 2.5457 3.1302 2.0000 1.9348 1.5181 1.1172 1.1497 1.2467 1.2724 1.4677 1.2583 1.4166 1.2093 1.5278 1.4299 1.3142 1.4544 1.1670 1.3629 1.5885 1.5744 1.0801 1.0910 1.0810 1.0826 1.0845 1.0597 1.0822 1.1036 1.0872 1.0455 1.0650 1.0945 1.0674 1.0655 1.0667
irintensity: 22.7185 17.4888 20.8097 31.2733 57.2439 45.7636 85.8966 68.4876 7.0798 12.6705 22.1042 5.4611 86.9445 13.8894 52.2897 68.1254 94.3261 13.8276 2.9635 29.9065 38.9232 75.8049 104.2242 130.9234 18.8988 17.1078 9.4264 54.2806 106.7466 34.5975 51.8544 139.4075 123.8726 21.7889 24.1856 54.6803 14.4716 3.5893 31.3532 4.9060 38.1907 14.8019 30.4554 14.3625 5.5142 27.9406 11.7719 7.2765 7.4772 15.0497 30.4579 1.5823 5.5002 0.5848 8.7668 64.7247 11.6201 48.3484 62.1507 35.9567 61.5151 32.5348 33.9680 2.0632 5.0505 3.9837 7.9150 16.1278 4.6517
temp: 298.150 k
press: 1.00000 atm
elementType: 8 8 8 8 8 7 6 6 6 6 6 6 1 1 1 1 1 1 1 1 1 1 1 1 1
symmnumber: 1
zpe: 528797.5 jmol-1
zpe.correction: 0.201408 hartree
zpe.thermalcorrener: 0.215014 hartree
zpe.thermalcorrenthalpy: 0.215959 hartree
zpe.thermalcorrgfe: 0.162009 hartree
zpe.sumelectzpe: -666.265553 hartree
zpe.sumelectthermal: -666.251947 hartree
zpe.sumelectthermalent: -666.251003 hartree
zpe.sumelectthermalfe: -666.304953 hartree
dipole: -0.4387 1.6614 -1.3374
dipole: 2.1775
quadrupole: -57.0398 -75.9214 -74.2858
quadrupole: 0.6123 -4.7289 6.1492
quadrupole: 12.0425 -6.8391 -5.2035 0.6123 -4.7289 6.1492
hfenergy: -666.4669616 hartree
pointgroup: C01 [X(C6H13N1O5)]
dipole: 0.189333 0.6506022 0.5242014 debye
dipolederiv: -0.9275993 0.3747775 -0.0732623 0.2417895 -0.8180288 0.0422764 0.0114047 -0.0374425 -0.3829836 -0.6198442 -0.2385901 -0.1545477 -0.2777474 -0.7180024 0.1946636 -0.1657114 0.1347701 -0.2783234 -0.6513322 -0.0456536 0.0178169 -0.0464985 -0.2414688 -0.1279501 0.0561705 -0.1721731 -0.6758496 -0.3925977 0.2265804 0.0965479 0.2651953 -0.9161871 0.1571682 0.0651022 0.2255574 -0.5158361 -0.5630774 -0.1620707 -0.2642439 -0.2147173 -0.592264 0.0363794 -0.3333443 0.0160763 -0.432725 -0.6331247 0.1458125 0.0978555 0.1312975 -0.3446054 0.0057101 0.1384036 -0.046141 -0.6115139 0.4117381 0.259824 0.0610257 0.2809906 0.5057871 -0.1183395 0.0106967 -0.1141845 0.2217856 0.2572042 -0.0773627 -0.022928 0.0612249 0.1560276 0.0342899 -0.1234238 0.0918028 0.5345096 0.3315468 -0.1738086 -0.1029892 -0.2259842 -0.0802578 0.099624 -0.010767 0.0493942 0.2593024 0.2573599 -0.1291082 0.0464729 -0.1906087 0.5009898 -0.1131432 0.2620935 -0.1100559 0.2524159 0.8842525 -0.3208122 0.0222763 -0.211302 1.061234 -0.1133716 -0.0644037 -0.0184334 0.5601072 0.4873802 0.199628 0.1835298 0.1856762 0.4072942 0.0471872 0.2184802 0.0346358 0.3258805 0.0062007 -0.0325495 -0.0086118 -0.0482177 -0.0146748 -0.0610128 -0.0583224 -0.03295 -0.1762866 0.0539181 0.0654352 -0.0302164 0.0824906 -0.0743209 0.08226 -0.0071678 0.0360703 -0.0070336 -0.0199271 0.0139908 0.0578277 0.0291566 0.0357336 -0.0463406 0.0823268 -0.043862 -0.1925252 0.0725251 -0.0044935 0.0455858 0.0439989 -0.0110635 -0.0551514 -0.0252271 0.0084921 -0.1505978 -0.0327015 0.0462485 -0.0495641 0.0056495 -0.0305889 0.0123344 0.004554 -0.026881 -0.2194632 0.0351903 -0.0306287 -0.0244136 -0.0707928 0.0458223 0.035103 -0.0143799 -0.0034167 -0.1560385 -0.0023238 0.022392 -0.0314977 0.0045218 -0.2086613 -0.0085578 -0.0528411 0.0312632 0.0429089 0.0802478 -0.052161 -0.0291976 -0.0879987 0.1478886 -0.0804121 -0.1000817 -0.0983149 0.2624492 0.1989592 0.0345532 0.0083532 0.0471157 0.112128 0.0582578 -0.049633 0.1391709 0.2693529 0.154433 0.011773 0.1234723 0.0699204 0.3417886 -0.1246903 0.1226255 -0.0838538 0.1892641 0.3713917 0.0408898 -0.0127048 0.0261807 0.1001519 0.1273014 -0.0181766 0.0945768 0.2998525 0.1646139 -0.1726659 -0.0712555 -0.1290904 0.2942487 -0.0122495 -0.1032802 -0.0075792 0.3263595 0.0755661 -0.0020002 0.1146687 0.0277494 0.3410293 -0.0713363 0.1549021 -0.0665217 0.2549882 unknown
polarizability: 102.6316005|-1.0319396|89.7175263|-1.749899|-0.5369084|71.3260046 unknown
InChI: InChI=1S/C6H13NO5/c7-3-5(10)4(9)2(1-8)12-6(3)11/h2-6,8-11H,1,7H2
charge 0 multiplicity 1
25 atoms
O  0.779681 0.987021 -0.356978
O  -2.074271 -2.056337 0.253381
O  0.368568 -1.68519 -1.367073
O  -0.900301 2.615787 -0.599719
O  3.528755 0.390169 0.839611
N  -2.907209 0.785557 0.387699
C  -1.143898 -0.954172 0.52215
C  0.273846 -1.366708 0.061466
C  -1.605893 0.357095 -0.160253
C  1.244094 -0.208212 0.402923
C  -0.543455 1.43138 0.126786
C  2.68815 -0.475594 -0.002037
H  -1.099331 -0.755804 1.617427
H  0.561163 -2.298477 0.578099
H  -1.621348 0.202363 -1.264177
H  1.221749 0.008866 1.49305
H  -0.468382 1.625708 1.223302
H  2.815795 -0.254753 -1.079522
H  2.924056 -1.545953 0.171976
H  -3.673467 0.168161 0.09554
H  -3.116028 1.763169 0.151126
H  -2.82918 -1.984652 0.890384
H  0.292727 -0.827191 -1.863715
H  -0.193861 3.299481 -0.476172
H  4.448839 0.411486 0.476923
