program: Gaussian 09
title: 000283649
version: EM64L-G09RevD.01
frameworkgroup: C1[X(C9H12O2)]
method: RPBEPBE
basis: SDD
operation: Freq
keyword: #pfreq=noraman
keyword: PBEPBE/SDD
title: #p freq=noraman PBEPBE/SDD
converged: NO YES NO NO
title: Mulliken charges:
elementType: O O C C C C C C C C C H H H H H H H H H H H H
charge: -0.213906 -0.207049 0.185265 -0.250685 -0.203108 -0.522250 -0.102565 -0.465583 -0.426185 0.152045 -0.783893 0.263431 0.255501 0.230040 0.237210 0.249474 0.221394 0.237702 0.241043 0.212350 0.216866 0.245419 0.227483
chargesum: 0.00000
title: Mulliken charges with hydrogens summed into heavy atoms:
elementType: O O C C C C C C C C C
charge: -0.213906 -0.207049 0.185265 0.012746 0.052392 -0.055000 0.146909 -0.006487 0.027208 0.152045 -0.094123
polarizability: 1.02176053e+02 -6.09286215e-02 8.92390307e+01 4.59314853e+00 -5.58689029e-01 8.17611502e+01
1716.lowfreq: -24.6366 -6.5564 -0.0005 0.0006 0.0009 26.1030 123.4399 177.3194 192.5426
frequency: 123.4032 177.3014 192.5374 246.4457 268.2868 329.6864 364.2911 399.3173 462.8132 475.6063 551.4627 585.8002 600.6895 696.2765 724.9942 778.3557 810.2076 824.2122 850.6039 876.2087 887.6246 911.5451 915.7772 950.8084 1001.8211 1007.6329 1037.1721 1062.6812 1064.5042 1085.4447 1114.5412 1132.9754 1165.0288 1186.9386 1193.4147 1203.5200 1242.1423 1254.1005 1270.4802 1289.3441 1300.9089 1310.3221 1336.3069 1346.2966 1391.7006 1453.6408 1465.3795 1472.5264 1475.3362 1491.5835 1691.5603 2985.7638 2996.3438 3008.9306 3030.0037 3049.8775 3056.1814 3062.0804 3075.6924 3081.5131 3085.6207 3090.0949 3099.4241
redmass: 6.8460 1.2378 2.0486 2.4334 3.0547 2.7606 2.7528 2.2506 4.6912 3.5070 5.7472 3.5827 6.6828 4.5936 3.9255 2.4683 2.5723 2.5576 2.6381 2.7006 2.0702 2.7317 2.3208 1.9349 1.7783 3.6763 1.5409 1.6300 1.9678 1.6216 1.2750 1.6312 1.6549 1.5829 2.3404 1.9784 1.4872 1.8478 1.2898 1.8247 1.5286 1.8108 1.4668 1.4592 1.2014 1.0861 1.0506 1.0663 1.0697 1.0879 12.3587 1.0355 1.0600 1.0648 1.0598 1.0994 1.0904 1.0912 1.1016 1.0994 1.0996 1.0913 1.1058
irintensity: 1.6666 0.9996 1.7882 0.7285 3.8564 0.4747 1.8779 0.9124 0.4562 0.8403 4.2360 5.1681 1.0461 2.1402 3.0363 0.6250 1.1216 0.9816 1.4747 37.2536 11.3882 62.1005 5.8460 0.9785 6.9095 82.3419 3.6196 2.0008 9.0283 12.7227 0.3450 14.6718 1.1312 7.9973 29.1200 12.9985 1.0281 0.4396 2.3278 2.3265 3.6986 5.4278 6.7422 1.2868 15.8200 9.7317 11.7560 1.0434 14.9448 13.4745 287.7069 24.8556 28.1670 22.4270 41.2415 16.8042 57.3193 17.4680 28.1319 27.8907 19.0852 44.6598 30.4403
temp: 298.150 k
press: 1.00000 atm
elementType: 8 8 6 6 6 6 6 6 6 6 6 1 1 1 1 1 1 1 1 1 1 1 1
symmnumber: 1
zpe: 506457.5 jmol-1
zpe.correction: 0.192899 hartree
zpe.thermalcorrener: 0.201809 hartree
zpe.thermalcorrenthalpy: 0.202753 hartree
zpe.thermalcorrgfe: 0.159641 hartree
zpe.sumelectzpe: -499.747915 hartree
zpe.sumelectthermal: -499.739005 hartree
zpe.sumelectthermalent: -499.738061 hartree
zpe.sumelectthermalfe: -499.781173 hartree
dipole: -3.8023 3.6046 -0.8324
dipole: 5.3051
quadrupole: -68.8633 -70.0627 -63.1087
quadrupole: 7.4546 -2.0326 0.6463
quadrupole: -1.5184 -2.7178 4.2362 7.4546 -2.0326 0.6463
hfenergy: -499.9408141 hartree
pointgroup: C01 [X(C9H12O2)]
dipole: 1.824568 -0.9405946 -0.3774942 debye
dipolederiv: -0.8939433 -0.0800322 0.1866111 -0.3636175 -0.6923526 0.2616778 0.4010086 0.1628143 -0.4965879 -1.0387698 0.0272206 0.2932031 0.1450535 -0.49331 -0.0217868 0.3646077 0.0259601 -0.453674 -0.1560634 0.1631992 -0.0060437 0.1978969 -0.1284183 0.0247842 0.0103998 -0.0116012 0.0052724 -0.0845684 -0.0871606 0.0767585 -0.0123918 -0.1146835 0.0562356 0.0956287 0.114242 0.1858456 0.1159993 -0.053002 0.0511258 -0.0082773 0.094689 -0.0486899 -0.0010482 -0.1419486 0.1349229 0.1654971 0.0936045 -0.0081519 0.0653957 0.0513891 -0.0134336 -0.0088507 -0.0036049 -0.0992296 0.6071353 0.0651975 -0.0643988 -0.0758399 0.3109439 -0.0410766 -0.0550704 -0.0072077 0.3329988 0.0753269 -0.0610965 0.0051722 -0.0164311 0.0285818 0.0410647 0.009123 -0.0039868 0.0540912 0.0151609 -0.0164314 -0.0437775 -0.0468637 0.0416505 -0.0126712 -0.0794339 0.0100184 -0.0522769 1.3418025 -0.0666225 -0.5016456 0.1311566 0.9272531 -0.2845382 -0.7331292 -0.1915803 0.5095491 0.0119299 -0.0269451 0.0099908 -0.0345587 0.0235334 0.0050878 0.0272796 0.0057524 0.0400447 0.0390794 -0.0067211 -0.0804217 -0.012035 0.0290508 -0.0447549 -0.0434609 -0.0462244 -0.1546307 0.0260389 -0.0096507 0.0195681 -0.009067 -0.0631011 0.1128994 -0.0022406 0.1026352 -0.0888345 -0.1911192 -0.0062707 0.0222648 -0.0893745 0.0772057 0.0200663 0.0091358 0.005701 0.0645346 0.0773187 -0.034487 -0.0072083 0.0206798 -0.1650476 -0.0630053 -0.0084246 -0.0483966 0.0645082 0.0163299 -0.0139104 0.0195385 -0.0220702 -0.0053257 0.0875158 0.0441737 0.0918817 -0.0898051 -0.094334 -0.0089098 -0.153424 0.0027695 0.0546408 0.020962 -0.111688 0.0052644 -0.0282899 -0.010936 0.0557517 0.1193802 0.0382186 -0.001953 -0.0662889 0.0744477 -0.0302851 -0.0031681 0.0996051 0.0196992 0.0000526 -0.0309874 -0.1412384 -0.0331902 -0.0079161 -0.0448677 0.0555573 -0.1478076 0.000128 0.0764316 0.0708237 0.0937048 -0.0046411 0.0468523 0.0083811 0.0237231 0.0096351 0.142938 0.0074463 0.0737589 -0.0811135 -0.0088946 -0.0005676 -0.0155197 0.0925237 0.0265051 -0.0542986 0.0774257 -0.0146633 0.0852151 -0.0105241 0.0992426 0.0360729 -0.0420717 -0.0098226 -0.0422003 -0.0998976 -0.0095757 0.0686855 0.0232019 -0.1300693 -0.0235005 -0.0550032 unknown
polarizability: 100.9973815|3.4521072|90.2296675|-4.9420066|-0.7238703|81.9491846 unknown
InChI: InChI=1S/C9H12O2/c1-9-5-2-3-7(6(9)4-5)11-8(9)10/h5-7H,2-4H2,1H3
charge 0 multiplicity 1
23 atoms
O  -0.714099 1.515472 -0.593819
O  -2.448756 0.621442 0.676891
C  -0.506971 -0.799703 -0.035205
C  0.512934 -0.504025 -1.1939
C  0.795678 -0.918576 0.896471
C  1.585525 -1.322949 -0.404121
C  0.66704 1.039251 -0.996735
C  1.287262 0.464989 1.390616
C  1.619172 1.373294 0.166983
C  -1.355745 0.463375 0.106168
C  -1.359871 -2.06777 -0.085941
H  0.250281 -0.786304 -2.22541
H  0.717367 -1.654215 1.713614
H  2.643632 -1.024461 -0.478232
H  1.499573 -2.39973 -0.62498
H  0.905118 1.593084 -1.917452
H  2.185648 0.342989 2.02379
H  0.510282 0.936879 2.021168
H  1.525758 2.442541 0.424324
H  2.659571 1.208457 -0.169509
H  -0.732331 -2.974413 -0.147678
H  -1.982367 -2.135435 0.82399
H  -2.041603 -2.057495 -0.955435
